id_mutation,date_mutation,numero_disposition,nature_mutation,valeur_fonciere,adresse_numero,adresse_suffixe,adresse_nom_voie,adresse_code_voie,code_postal,code_commune,nom_commune,code_departement,ancien_code_commune,ancien_nom_commune,id_parcelle,ancien_id_parcelle,numero_volume,lot1_numero,lot1_surface_carrez,lot2_numero,lot2_surface_carrez,lot3_numero,lot3_surface_carrez,lot4_numero,lot4_surface_carrez,lot5_numero,lot5_surface_carrez,nombre_lots,code_type_local,type_local,surface_reelle_bati,nombre_pieces_principales,code_nature_culture,nature_culture,code_nature_culture_speciale,nature_culture_speciale,surface_terrain,longitude,latitude
2021-1194639,2021-01-18,000001,Vente,14.8,,,LA GOBERGE,B294,71500,71056,Branges,71,,,710560000A0787,,,,,,,,,,,,,0,,,,,P,prés,,,74,5.133407,46.667893
2021-1194640,2021-01-06,000001,Vente,86000,425,,RTE DES VERNETS,0835,71500,71056,Branges,71,,,710560000E0694,,,,,,,,,,,,,0,1,Maison,77,5,S,sols,,,1582,5.161007,46.645687
2021-1194640,2021-01-06,000001,Vente,86000,425,,RTE DES VERNETS,0835,71500,71056,Branges,71,,,710560000E0694,,,,,,,,,,,,,0,3,Dépendance,,0,S,sols,,,1582,5.161007,46.645687
2021-1194665,2021-01-18,000001,Vente,55000,35,,CHE DU PARADIS,0520,71500,71056,Branges,71,,,71056000AC0122,,,,,,,,,,,,,0,1,Maison,70,2,S,sols,,,1610,5.178264,46.646965
2021-1194665,2021-01-18,000001,Vente,55000,,,LE PARADIS,B378,71500,71056,Branges,71,,,71056000AC0123,,,,,,,,,,,,,0,,,,,T,terres,,,744,5.17824,46.64668
2021-1194686,2021-02-02,000001,Vente,42000,,,LE MONT,B363,71500,71056,Branges,71,,,71056000AO0073,,,,,,,,,,,,,0,,,,,P,prés,,,7974,5.17438,46.646301
2021-1194686,2021-02-02,000001,Vente,42000,,,LE MONT,B363,71500,71056,Branges,71,,,71056000AO0073,,,,,,,,,,,,,0,,,,,P,prés,,,3986,5.17438,46.646301
2021-1194687,2021-02-02,000001,Vente,44000,1160,,RTE DU BOURG,0090,71500,71056,Branges,71,,,71056000AN0308,,,6,,,,,,,,,,1,3,Dépendance,,0,,,,,,5.180906,46.643218
2021-1194687,2021-02-02,000001,Vente,44000,1160,,RTE DU BOURG,0090,71500,71056,Branges,71,,,71056000AN0308,,,3,,4,,5,,7,,,,4,3,Dépendance,,0,,,,,,5.180906,46.643218
2021-1194687,2021-02-02,000001,Vente,44000,1160,,RTE DU BOURG,0090,71500,71056,Branges,71,,,71056000AN0308,,,3,,4,,5,,7,,,,4,3,Dépendance,,0,,,,,,5.180906,46.643218
2021-1194687,2021-02-02,000001,Vente,44000,1160,,RTE DU BOURG,0090,71500,71056,Branges,71,,,71056000AN0308,,,3,,4,,5,,7,,,,4,2,Appartement,40,2,,,,,,5.180906,46.643218
2021-1194714,2021-02-02,000001,Vente,15000,,,LES SABLES,B520,71500,71056,Branges,71,,,71056000AE0659,,,,,,,,,,,,,0,,,,,P,prés,,,1181,5.197617,46.646933
2021-1194751,2021-01-16,000001,Vente,73000,35,,RUE DU TEMPLE,0740,71500,71056,Branges,71,,,710560000F0524,,,,,,,,,,,,,0,1,Maison,38,2,S,sols,,,605,5.152397,46.653871
2021-1194753,2021-01-28,000002,Vente,9300,315,,RTE DES LIETS,0385,71500,71056,Branges,71,,,71056000AD0652,,,,,,,,,,,,,0,,,,,S,sols,,,425,5.184986,46.646724
2021-1194753,2021-01-28,000002,Vente,9300,,,LES LIETS,B338,71500,71056,Branges,71,,,71056000AD0653,,,,,,,,,,,,,0,,,,,T,terres,,,78,5.184835,46.646727
2021-1194775,2021-01-23,000001,Vente,66000,,,LE BOURG NEUF,B053,71500,71056,Branges,71,,,71056000AM0192,,,,,,,,,,,,,0,,,,,T,terres,,,146,5.178238,46.642049
2021-1194775,2021-01-23,000001,Vente,66000,180,,RTE DE SORNAY,0720,71500,71056,Branges,71,,,71056000AM0194,,,,,,,,,,,,,0,2,Appartement,110,4,S,sols,,,175,5.178401,46.642033
2021-1194775,2021-01-23,000001,Vente,66000,180,,RTE DE SORNAY,0720,71500,71056,Branges,71,,,71056000AM0194,,,,,,,,,,,,,0,3,Dépendance,,0,S,sols,,,175,5.178401,46.642033
2021-1194775,2021-01-23,000001,Vente,66000,,,LE MOULIN DE BRANGES,B366,71500,71056,Branges,71,,,71056000AM0196,,,,,,,,,,,,,0,,,,,S,sols,,,42,5.178511,46.642046
2021-1194805,2021-02-02,000001,Vente,180000,740,,RTE DES PIES,0560,71500,71056,Branges,71,,,71056000AI0136,,,,,,,,,,,,,0,1,Maison,130,6,AG,terrains d'agrément,,,1122,5.198442,46.641076
2021-1194805,2021-02-02,000001,Vente,180000,740,,RTE DES PIES,0560,71500,71056,Branges,71,,,71056000AI0136,,,,,,,,,,,,,0,1,Maison,130,6,S,sols,,,792,5.198442,46.641076
2021-1194820,2021-01-28,000002,Vente,86000,1325,,RTE DES PIES,0560,71500,71056,Branges,71,,,71056000AH0290,,,,,,,,,,,,,0,,,,,S,sols,,,447,5.205064,46.638772
2021-1194873,2021-02-22,000001,Vente,21886,,,LES CHAINTRES,B078,71500,71056,Branges,71,,,710560000A0078,,,,,,,,,,,,,0,,,,,T,terres,,,5250,5.130046,46.673048
2021-1194873,2021-02-22,000001,Vente,21886,,,LES CHAINTRES,B078,71500,71056,Branges,71,,,710560000A0084,,,,,,,,,,,,,0,,,,,T,terres,,,1866,5.130734,46.671229
2021-1194873,2021-02-22,000001,Vente,21886,,,LES CHAINTRES,B078,71500,71056,Branges,71,,,710560000A0085,,,,,,,,,,,,,0,,,,,T,terres,,,65790,5.131661,46.670955
2021-1194873,2021-02-22,000001,Vente,21886,,,LE RECY ETIENNE,B501,71500,71056,Branges,71,,,710560000A0353,,,,,,,,,,,,,0,,,,,BT,taillis simples,ACACI,Acacias,3470,5.143025,46.662278
2021-1194873,2021-02-22,000001,Vente,21886,,,LES CHAINTRES,B078,71500,71056,Branges,71,,,710560000A0744,,,,,,,,,,,,,0,,,,,P,prés,,,6250,5.130276,46.672311
2021-1194876,2021-02-23,000001,Vente,133000,810,,RTE DES PIES,0560,71500,71056,Branges,71,,,71056000AI0130,,,,,,,,,,,,,0,1,Maison,85,4,S,sols,,,1551,5.19921,46.641
2021-1194902,2021-02-26,000001,Vente,62000,595,,RUE DE BEAUMONT,0025,71500,71056,Branges,71,,,710560000F0899,,,,,,,,,,,,,0,1,Maison,66,3,S,sols,,,739,5.133749,46.644672
2021-1194919,2021-03-04,000001,Vente,77500,,,LES BOUTIERES,B054,71500,71056,Branges,71,,,71056000AD0375,,,,,,,,,,,,,0,,,,,J,jardins,POTAG,Jardin potager,882,5.182193,46.646519
2021-1194919,2021-03-04,000001,Vente,77500,75,,RTE DES LIETS,0385,71500,71056,Branges,71,,,71056000AD0549,,,,,,,,,,,,,0,2,Appartement,54,2,S,sols,,,1591,5.181815,46.646499
2021-1194919,2021-03-04,000001,Vente,77500,75,,RTE DES LIETS,0385,71500,71056,Branges,71,,,71056000AD0549,,,,,,,,,,,,,0,2,Appartement,65,2,S,sols,,,1591,5.181815,46.646499
2021-1194919,2021-03-04,000001,Vente,77500,75,,RTE DES LIETS,0385,71500,71056,Branges,71,,,71056000AD0549,,,,,,,,,,,,,0,2,Appartement,76,4,S,sols,,,1591,5.181815,46.646499
2021-1194919,2021-03-04,000001,Vente,77500,,,BEAUREGARD,B011,71500,71056,Branges,71,,,71056000AD0554,,,,,,,,,,,,,0,,,,,S,sols,,,85,5.181639,46.646604
2021-1194919,2021-03-04,000001,Vente,77500,,,BEAUREGARD,B011,71500,71056,Branges,71,,,71056000AD0556,,,,,,,,,,,,,0,,,,,S,sols,,,267,5.18221,46.646641
2021-1194960,2021-02-25,000001,Vente,140250,50,,RUE DE L'EGLISE,0230,71500,71056,Branges,71,,,71056000AN0212,,,,,,,,,,,,,0,1,Maison,80,3,S,sols,,,607,5.17524,46.643553
2021-1194960,2021-02-25,000001,Vente,140250,,,RUE DE L'EGLISE,0230,71500,71056,Branges,71,,,71056000AN0448,,,,,,,,,,,,,0,,,,,S,sols,,,130,5.175344,46.643626
2021-1194995,2021-03-19,000001,Vente,158000,,,LE BOURG,B052,71500,71056,Branges,71,,,71056000AO0055,,,,,,,,,,,,,0,,,,,S,sols,,,690,5.174626,46.643686
2021-1194995,2021-03-19,000001,Vente,158000,75,,RUE DE L'EGLISE,0230,71500,71056,Branges,71,,,71056000AO0056,,,,,,,,,,,,,0,1,Maison,108,4,S,sols,,,492,5.174919,46.643666
2021-1194995,2021-03-19,000001,Vente,158000,75,,RUE DE L'EGLISE,0230,71500,71056,Branges,71,,,71056000AO0056,,,,,,,,,,,,,0,3,Dépendance,,0,S,sols,,,492,5.174919,46.643666
2021-1195027,2021-03-05,000001,Vente,149000,,,LES PIES,B418,71500,71056,Branges,71,,,71056000AH0281,,,,,,,,,,,,,0,,,,,AG,terrains d'agrément,,,391,5.201538,46.640807
2021-1195027,2021-03-05,000001,Vente,149000,985,,RTE DES PIES,0560,71500,71056,Branges,71,,,71056000AH0283,,,,,,,,,,,,,0,,,,,S,sols,,,64,5.201415,46.640759
2021-1195027,2021-03-05,000001,Vente,149000,965,,RTE DES PIES,0560,71500,71056,Branges,71,,,71056000AH0287,,,,,,,,,,,,,0,2,Appartement,142,4,S,sols,,,719,5.201267,46.640811
2021-1195027,2021-03-05,000001,Vente,149000,965,,RTE DES PIES,0560,71500,71056,Branges,71,,,71056000AH0287,,,,,,,,,,,,,0,3,Dépendance,,0,S,sols,,,719,5.201267,46.640811
2021-1195027,2021-03-05,000001,Vente,149000,,,CHAMP DE LICHOT,B107,71500,71056,Branges,71,,,71056000AK0215,,,,,,,,,,,,,0,,,,,S,sols,,,152,5.201137,46.640857
2021-1195032,2021-03-22,000001,Vente,84000,250,,RTE DU PARADIS,0535,71500,71056,Branges,71,,,71056000AN0015,,,,,,,,,,,,,0,1,Maison,107,4,S,sols,,,1644,5.179227,46.646155
2021-1195032,2021-03-22,000001,Vente,84000,250,,RTE DU PARADIS,0535,71500,71056,Branges,71,,,71056000AN0015,,,,,,,,,,,,,0,3,Dépendance,,0,S,sols,,,1644,5.179227,46.646155
2021-1195032,2021-03-22,000001,Vente,84000,,,LE PARADIS,B378,71500,71056,Branges,71,,,71056000AN0359,,,,,,,,,,,,,0,,,,,J,jardins,POTAG,Jardin potager,500,5.179036,46.645913
2021-1195032,2021-03-22,000001,Vente,84000,,,LE PARADIS,B378,71500,71056,Branges,71,,,71056000AN0359,,,,,,,,,,,,,0,,,,,P,prés,,,1035,5.179036,46.645913
2021-1195057,2021-03-30,000001,Vente,22000,,,LES ZITS,B575,71500,71056,Branges,71,,,71056000AB0311,,,,,,,,,,,,,0,,,,,AB,terrains a bâtir,,,2001,5.18546,46.661977
2021-1195063,2021-03-15,000001,Vente en l'état futur d'achèvement,163000,,,LES LIETS,B338,71500,71056,Branges,71,,,71056000AD0642,,,,,,,,,,,,,0,,,,,S,sols,,,585,5.186614,46.647169
2021-1195071,2021-04-07,000001,Vente,126000,5,,RUE DES GAUTRELLES,0275,71500,71056,Branges,71,,,710560000E0837,,,,,,,,,,,,,0,1,Maison,94,4,S,sols,,,821,5.160841,46.646382
2021-1195071,2021-04-07,000001,Vente,126000,,,LES GAUTRELLES,B291,71500,71056,Branges,71,,,710560000E0839,,,,,,,,,,,,,0,,,,,S,sols,,,131,5.161158,46.646189
2021-1195077,2021-04-10,000001,Vente,240000,15,,IMP DES BIOUX,0040,71500,71056,Branges,71,,,710560000F1041,,,,,,,,,,,,,0,3,Dépendance,,0,S,sols,,,3114,5.142979,46.644481
2021-1195077,2021-04-10,000001,Vente,240000,15,,IMP DES BIOUX,0040,71500,71056,Branges,71,,,710560000F1041,,,,,,,,,,,,,0,3,Dépendance,,0,P,prés,,,7813,5.142979,46.644481
2021-1195077,2021-04-10,000001,Vente,240000,15,,IMP DES BIOUX,0040,71500,71056,Branges,71,,,710560000F1041,,,,,,,,,,,,,0,3,Dépendance,,0,S,sols,,,3114,5.142979,46.644481
2021-1195077,2021-04-10,000001,Vente,240000,15,,IMP DES BIOUX,0040,71500,71056,Branges,71,,,710560000F1041,,,,,,,,,,,,,0,1,Maison,150,5,P,prés,,,7813,5.142979,46.644481
2021-1195077,2021-04-10,000001,Vente,240000,15,,IMP DES BIOUX,0040,71500,71056,Branges,71,,,710560000F1041,,,,,,,,,,,,,0,1,Maison,150,5,S,sols,,,3114,5.142979,46.644481
2021-1195077,2021-04-10,000001,Vente,240000,15,,IMP DES BIOUX,0040,71500,71056,Branges,71,,,710560000F1041,,,,,,,,,,,,,0,3,Dépendance,,0,P,prés,,,7813,5.142979,46.644481
2021-1195108,2021-04-08,000001,Vente,75000,1180,,RTE DU BOURG,0090,71500,71056,Branges,71,,,71056000AN0204,,,,,,,,,,,,,0,3,Dépendance,,0,S,sols,,,397,5.181038,46.643098
2021-1195108,2021-04-08,000001,Vente,75000,1180,,RTE DU BOURG,0090,71500,71056,Branges,71,,,71056000AN0204,,,,,,,,,,,,,0,3,Dépendance,,0,S,sols,,,397,5.181038,46.643098
2021-1195108,2021-04-08,000001,Vente,75000,1180,,RTE DU BOURG,0090,71500,71056,Branges,71,,,71056000AN0204,,,,,,,,,,,,,0,3,Dépendance,,0,S,sols,,,397,5.181038,46.643098
2021-1195108,2021-04-08,000001,Vente,75000,1180,,RTE DU BOURG,0090,71500,71056,Branges,71,,,71056000AN0204,,,,,,,,,,,,,0,2,Appartement,88,3,S,sols,,,397,5.181038,46.643098
2021-1195108,2021-04-08,000001,Vente,75000,1180,,RTE DU BOURG,0090,71500,71056,Branges,71,,,71056000AN0204,,,,,,,,,,,,,0,2,Appartement,77,3,S,sols,,,397,5.181038,46.643098
2021-1195159,2021-04-21,000001,Vente,119000,225,,RTE DU BOURG,0090,71500,71056,Branges,71,,,71056000AP0136,,,,,,,,,,,,,0,3,Dépendance,,0,S,sols,,,1375,5.169262,46.644651
2021-1195159,2021-04-21,000001,Vente,119000,225,,RTE DU BOURG,0090,71500,71056,Branges,71,,,71056000AP0136,,,,,,,,,,,,,0,3,Dépendance,,0,S,sols,,,1375,5.169262,46.644651
2021-1195159,2021-04-21,000001,Vente,119000,225,,RTE DU BOURG,0090,71500,71056,Branges,71,,,71056000AP0136,,,,,,,,,,,,,0,1,Maison,101,4,S,sols,,,1375,5.169262,46.644651
2021-1195275,2021-04-23,000001,Vente,75000,70,,RTE DE MONTRET,0440,71500,71056,Branges,71,,,71056000AC0132,,,,,,,,,,,,,0,1,Maison,85,3,S,sols,,,859,5.17485,46.647537
2021-1195275,2021-04-23,000001,Vente,75000,,,CHAMP DE LA TUILERIE,B105,71500,71056,Branges,71,,,71056000AC0133,,,,,,,,,,,,,0,,,,,T,terres,,,919,5.174546,46.647449
2021-1195275,2021-04-23,000001,Vente,75000,,,CHAMP DE LA TUILERIE,B105,71500,71056,Branges,71,,,71056000AC0134,,,,,,,,,,,,,0,,,,,P,prés,,,1220,5.174759,46.647695
2021-1195278,2021-04-29,000002,Vente,1,65,,CHE DU PETIT CHARMONT,0540,71500,71056,Branges,71,,,710560000C0807,,,,,,,,,,,,,0,,,,,S,sols,,,11,5.186294,46.66411
2021-1195297,2021-05-05,000001,Vente,18000,,,CHAMP BORE,B084,71500,71056,Branges,71,,,71056000AK0293,,,,,,,,,,,,,0,,,,,AB,terrains a bâtir,,,996,5.196225,46.644888
2021-1195297,2021-05-05,000001,Vente,18000,260,,RTE DES SABLES,0680,71500,71056,Branges,71,,,71056000AK0296,,,,,,,,,,,,,0,,,,,S,sols,,,38,5.196247,46.645365
2021-1195297,2021-05-05,000001,Vente,18000,,,CHAMP BORE,B084,71500,71056,Branges,71,,,71056000AK0297,,,,,,,,,,,,,0,,,,,T,terres,,,144,5.196152,46.644565
2021-1195297,2021-05-05,000001,Vente,18000,,,CHAMP BORE,B084,71500,71056,Branges,71,,,71056000AK0298,,,,,,,,,,,,,0,,,,,T,terres,,,598,5.196081,46.64485
2021-1195306,2021-05-05,000001,Vente,100000,1060,,RTE DE JUIF,0370,71500,71056,Branges,71,,,710560000B0301,,,,,,,,,,,,,0,1,Maison,80,4,S,sols,,,756,5.160056,46.660048
2021-1195306,2021-05-05,000001,Vente,100000,1060,,RTE DE JUIF,0370,71500,71056,Branges,71,,,710560000B0301,,,,,,,,,,,,,0,3,Dépendance,,0,S,sols,,,756,5.160056,46.660048
2021-1195310,2021-04-30,000001,Vente,190000,360,,RUE DU TRIAGE,0750,71500,71056,Branges,71,,,710560000C0800,,,,,,,,,,,,,0,1,Maison,125,3,AG,terrains d'agrément,,,1541,5.185914,46.661198
2021-1195310,2021-04-30,000001,Vente,190000,360,,RUE DU TRIAGE,0750,71500,71056,Branges,71,,,710560000C0800,,,,,,,,,,,,,0,1,Maison,125,3,S,sols,,,1000,5.185914,46.661198
2021-1195310,2021-04-30,000001,Vente,190000,,,LE TRIAGE,B554,71500,71056,Branges,71,,,710560000C0802,,,,,,,,,,,,,0,,,,,AG,terrains d'agrément,,,924,5.186401,46.661074
2021-1195310,2021-04-30,000001,Vente,190000,,,LE TRIAGE,B554,71500,71056,Branges,71,,,710560000C0804,,,,,,,,,,,,,0,,,,,P,prés,,,35,5.186278,46.660812
2021-1195341,2021-05-26,000001,Vente,126500,15,,IMP DU CHATELET,0155,71500,71056,Branges,71,,,710560000A1003,,,,,,,,,,,,,0,1,Maison,80,5,S,sols,,,800,5.151493,46.654805
2021-1195341,2021-05-26,000001,Vente,126500,15,,IMP DU CHATELET,0155,71500,71056,Branges,71,,,710560000A1003,,,,,,,,,,,,,0,1,Maison,80,5,P,prés,,,1152,5.151493,46.654805
2021-1195341,2021-05-26,000001,Vente,126500,,,LE CHATELET,B157,71500,71056,Branges,71,,,710560000A1006,,,,,,,,,,,,,0,,,,,T,terres,,,463,5.15112,46.65484
2021-1195341,2021-05-26,000001,Vente,126500,,,LE CHATELET,B157,71500,71056,Branges,71,,,710560000A1009,,,,,,,,,,,,,0,,,,,AG,terrains d'agrément,,,6,5.151065,46.65468
2021-1195342,2021-05-26,000001,Vente,159000,15,,IMP DES ACACIAS,0009,71500,71056,Branges,71,,,71056000AE0418,,,,,,,,,,,,,0,1,Maison,139,4,S,sols,,,500,5.199052,46.645606
2021-1195342,2021-05-26,000001,Vente,159000,15,,IMP DES ACACIAS,0009,71500,71056,Branges,71,,,71056000AE0418,,,,,,,,,,,,,0,1,Maison,139,4,AG,terrains d'agrément,,,1173,5.199052,46.645606
2021-1195342,2021-05-26,000001,Vente,159000,,,LES SABLES,B520,71500,71056,Branges,71,,,71056000AE0419,,,,,,,,,,,,,0,,,,,S,sols,,,268,5.199297,46.645543
2021-1195359,2021-05-11,000001,Vente,186000,535,,RTE DE SAVIGNY,0700,71500,71056,Branges,71,,,710560000F0391,,,,,,,,,,,,,0,1,Maison,95,4,S,sols,,,1185,5.138855,46.640188
2021-1195359,2021-05-11,000001,Vente,186000,535,,RTE DE SAVIGNY,0700,71500,71056,Branges,71,,,710560000F0391,,,,,,,,,,,,,0,1,Maison,95,4,P,prés,,,5133,5.138855,46.640188
2021-1195384,2021-05-18,000002,Vente,18000,,,AUX MARES,B348,71500,71056,Branges,71,,,710560000E0905,,,,,,,,,,,,,0,,,,,T,terres,,,300,5.160128,46.647323
2021-1195384,2021-05-18,000002,Vente,18000,,,AUX MARES,B348,71500,71056,Branges,71,,,710560000E0905,,,,,,,,,,,,,0,,,,,T,terres,,,601,5.160128,46.647323
2021-1195384,2021-05-18,000002,Vente,18000,,,AUX MARES,B348,71500,71056,Branges,71,,,710560000E0938,,,,,,,,,,,,,0,,,,,AB,terrains a bâtir,,,1374,5.159735,46.64691
2021-1195385,2021-05-18,000003,Vente,9000,,,AUX MARES,B348,71500,71056,Branges,71,,,710560000E0937,,,,,,,,,,,,,0,,,,,AB,terrains a bâtir,,,1129,5.159636,46.646739
2021-1195387,2021-05-07,000002,Vente,20000,,,LA ROCHE,B513,71500,71056,Branges,71,,,71056000AN0477,,,,,,,,,,,,,0,,,,,AB,terrains a bâtir,,,1282,5.181161,46.645484
2021-1195388,2021-05-07,000001,Vente,6400,,,LA ROCHE,B513,71500,71056,Branges,71,,,71056000AN0476,,,,,,,,,,,,,0,,,,,J,jardins,POTAG,Jardin potager,7,5.181708,46.645352
2021-1195388,2021-05-07,000001,Vente,6400,,,LA ROCHE,B513,71500,71056,Branges,71,,,71056000AN0478,,,,,,,,,,,,,0,,,,,AB,terrains a bâtir,,,586,5.181641,46.64543
2021-1195398,2021-06-03,000001,Vente,305000,180,,IMP DU BOIS DE CHIZE,0055,71500,71056,Branges,71,,,710560000C0646,,,,,,,,,,,,,0,4,Local industriel. commercial ou assimilé,1080,0,S,sols,,,6154,,
2021-1195462,2021-06-03,000001,Vente,152100,,,LA BUTARDE,B060,71500,71056,Branges,71,,,710560000B0554,,,,,,,,,,,,,0,,,,,AG,terrains d'agrément,,,546,5.163856,46.651932
2021-1195462,2021-06-03,000001,Vente,152100,220,,RUE DE LA BUTARDE,0110,71500,71056,Branges,71,,,710560000B0556,,,,,,,,,,,,,0,1,Maison,134,6,S,sols,,,838,5.164131,46.651688
2021-1195462,2021-06-03,000001,Vente,152100,220,,RUE DE LA BUTARDE,0110,71500,71056,Branges,71,,,710560000B0556,,,,,,,,,,,,,0,1,Maison,134,6,AG,terrains d'agrément,,,1000,5.164131,46.651688
2021-1195467,2021-05-21,000001,Vente,1,,,CHAMP DE LA PERCHE,B103,71500,71056,Branges,71,,,710560000B0461,,,,,,,,,,,,,0,,,,,T,terres,,,1012,,
2021-1195467,2021-05-21,000001,Vente,1,,,CHAMP DE LA PERCHE,B103,71500,71056,Branges,71,,,710560000B0462,,,,,,,,,,,,,0,,,,,T,terres,,,2895,,
2021-1195467,2021-05-21,000001,Vente,1,,,CHAMP DE LA PERCHE,B103,71500,71056,Branges,71,,,710560000B0464,,,,,,,,,,,,,0,,,,,T,terres,,,65,5.166487,46.651585
2021-1195467,2021-05-21,000001,Vente,1,,,CHAMP DE LA PERCHE,B103,71500,71056,Branges,71,,,710560000B0465,,,,,,,,,,,,,0,,,,,T,terres,,,4591,,
2021-1195467,2021-05-21,000001,Vente,1,,,CHAMP DE LA PERCHE,B103,71500,71056,Branges,71,,,710560000B0467,,,,,,,,,,,,,0,,,,,T,terres,,,4033,,
2021-1195467,2021-05-21,000001,Vente,1,,,CHAMP DE LA PERCHE,B103,71500,71056,Branges,71,,,710560000B0468,,,,,,,,,,,,,0,,,,,T,terres,,,3594,,
2021-1195467,2021-05-21,000001,Vente,1,,,AU GRAND CHEMIN,B301,71500,71056,Branges,71,,,710560000B0511,,,,,,,,,,,,,0,,,,,AB,terrains a bâtir,,,1931,5.166483,46.651321
2021-1195561,2021-06-15,000001,Vente,207700,,,LES CORVEES,B187,71500,71056,Branges,71,,,71056000AK0060,,,,,,,,,,,,,0,,,,,AG,terrains d'agrément,,,557,5.19911,46.641421
2021-1195561,2021-06-15,000001,Vente,207700,785,,RTE DES PIES,0560,71500,71056,Branges,71,,,71056000AK0061,,,,,,,,,,,,,0,1,Maison,131,4,S,sols,,,658,5.198786,46.641468
2021-1195561,2021-06-15,000001,Vente,207700,785,,RTE DES PIES,0560,71500,71056,Branges,71,,,71056000AK0061,,,,,,,,,,,,,0,3,Dépendance,,0,S,sols,,,658,5.198786,46.641468
2021-1195561,2021-06-15,000001,Vente,207700,,,LES CORVEES,B187,71500,71056,Branges,71,,,71056000AK0062,,,,,,,,,,,,,0,,,,,AG,terrains d'agrément,,,1302,5.198782,46.641553
2021-1195570,2021-06-08,000001,Vente,1100,,,LE REBERGER,B496,71500,71056,Branges,71,,,71056000AI0057,,,,,,,,,,,,,0,,,,,P,prés,,,7177,5.197224,46.638784
2021-1195603,2021-06-25,000001,Vente,70000,125,,RUE DES JARDINS FLEURIS,0367,71500,71056,Branges,71,,,71056000AH0104,,,,,,,,,,,,,0,1,Maison,81,4,S,sols,,,665,5.203872,46.640635
2021-1195603,2021-06-25,000001,Vente,70000,,,LES PIES,B418,71500,71056,Branges,71,,,71056000AH0105,,,,,,,,,,,,,0,,,,,T,terres,,,3751,5.204159,46.640907
2021-1195603,2021-06-25,000001,Vente,70000,,,LES PIES,B418,71500,71056,Branges,71,,,71056000AH0125,,,,,,,,,,,,,0,,,,,P,prés,,,39,5.203659,46.640646
2021-1195611,2021-06-18,000001,Vente,216193,85,,RUE DES INDUSTRIES,0330,71500,71056,Branges,71,,,71056000AD0646,,,,,,,,,,,,,0,4,Local industriel. commercial ou assimilé,,,S,sols,,,4893,5.190458,46.653274
2021-1195630,2021-07-09,000001,Vente,84000,455,,RUE DU LADRE,0375,71500,71056,Branges,71,,,71056000AL0046,,,,,,,,,,,,,0,1,Maison,80,3,S,sols,,,359,5.19249,46.643561
2021-1195630,2021-07-09,000001,Vente,84000,,,RUE DU LADRE,B519,71500,71056,Branges,71,,,71056000AL0047,,,,,,,,,,,,,0,,,,,J,jardins,POTAG,Jardin potager,481,5.192567,46.64388
2021-1195630,2021-07-09,000001,Vente,84000,,,RUE DU LADRE,B519,71500,71056,Branges,71,,,71056000AL0048,,,,,,,,,,,,,0,,,,,BT,taillis simples,ACACI,Acacias,369,5.192629,46.644131
2021-1195655,2021-06-22,000001,Vente,76500,75,,RUE DES VENETS,0810,71500,71056,Branges,71,,,71056000AB0228,,,,,,,,,,,,,0,1,Maison,50,3,S,sols,,,1226,5.1822,46.660884
2021-1195655,2021-06-22,000001,Vente,76500,,,LA BORDENIERE,B045,71500,71056,Branges,71,,,71056000AB0238,,,,,,,,,,,,,0,,,,,S,sols,,,21,5.181944,46.661025
2021-1195655,2021-06-22,000001,Vente,76500,,,LA BORDENIERE,B045,71500,71056,Branges,71,,,71056000AB0255,,,,,,,,,,,,,0,,,,,S,sols,,,30,5.181923,46.661031
2021-1195739,2021-07-08,000001,Vente,74500,905,,RTE DU BOURG,0090,71500,71056,Branges,71,,,71056000AN0307,,,,,,,,,,,,,0,3,Dépendance,,0,S,sols,,,380,5.177594,46.643317
2021-1195739,2021-07-08,000001,Vente,74500,905,,RTE DU BOURG,0090,71500,71056,Branges,71,,,71056000AN0307,,,,,,,,,,,,,0,1,Maison,200,6,S,sols,,,380,5.177594,46.643317
2021-1195749,2021-07-27,000001,Vente,132000,115,,RUE DE L'EGLISE,0230,71500,71056,Branges,71,,,71056000AO0051,,,,,,,,,,,,,0,3,Dépendance,,0,S,sols,,,1720,5.174588,46.644156
2021-1195749,2021-07-27,000001,Vente,132000,115,,RUE DE L'EGLISE,0230,71500,71056,Branges,71,,,71056000AO0051,,,,,,,,,,,,,0,3,Dépendance,,0,S,sols,,,1720,5.174588,46.644156
2021-1195749,2021-07-27,000001,Vente,132000,115,,RUE DE L'EGLISE,0230,71500,71056,Branges,71,,,71056000AO0051,,,,,,,,,,,,,0,1,Maison,90,4,S,sols,,,1720,5.174588,46.644156
2021-1195883,2021-08-06,000001,Vente,160000,135,,RTE DE JUIF,0370,71500,71056,Branges,71,,,710560000A1036,,,,,,,,,,,,,0,1,Maison,111,4,S,sols,,,1000,5.161249,46.652668
2021-1195883,2021-08-06,000001,Vente,160000,135,,RTE DE JUIF,0370,71500,71056,Branges,71,,,710560000A1036,,,,,,,,,,,,,0,1,Maison,111,4,AG,terrains d'agrément,,,409,5.161249,46.652668
2021-1195894,2021-08-05,000001,Vente,45000,235,,RUE DES SENNECIERES,0710,71500,71056,Branges,71,,,71056000AB0185,,,,,,,,,,,,,0,1,Maison,93,3,S,sols,,,1690,5.185994,46.658303
2021-1195894,2021-08-05,000001,Vente,45000,,,LES SENNECIERES,B528,71500,71056,Branges,71,,,71056000AB0186,,,,,,,,,,,,,0,,,,,P,prés,,,2800,5.185209,46.658697
2021-1195970,2021-08-23,000001,Vente,188400,,,LE BOURG,B052,71500,71056,Branges,71,,,71056000AO0116,,,,,,,,,,,,,0,,,,,AG,terrains d'agrément,,,245,5.174115,46.643786
2021-1195970,2021-08-23,000001,Vente,188400,95,,IMP DES GRIOTTIERS,0298,71500,71056,Branges,71,,,71056000AO0117,,,,,,,,,,,,,0,1,Maison,87,4,S,sols,,,885,5.174182,46.643668
2021-1195970,2021-08-23,000001,Vente,188400,,,LE BOURG,B052,71500,71056,Branges,71,,,71056000AO0119,,,,,,,,,,,,,0,,,,,S,sols,,,302,5.173602,46.643683
2021-1195970,2021-08-23,000001,Vente,188400,,,LE BOURG,B052,71500,71056,Branges,71,,,71056000AO0122,,,,,,,,,,,,,0,,,,,S,sols,,,114,5.173361,46.643746
2021-1195974,2021-08-23,000001,Vente,1000,,,LES FAUSSES,B280,71500,71056,Branges,71,,,710560000E0010,,,,,,,,,,,,,0,,,,,P,prés,,,5085,5.162104,46.643019
2021-1195974,2021-08-23,000001,Vente,1000,,,LES NIEVRES,B374,71500,71056,Branges,71,,,710560000E0383,,,,,,,,,,,,,0,,,,,P,prés,,,3993,5.162377,46.639999
2021-1195974,2021-08-23,000001,Vente,1000,,,LES NIEVRES,B374,71500,71056,Branges,71,,,710560000E0384,,,,,,,,,,,,,0,,,,,P,prés,,,992,5.162104,46.639813
2021-1195991,2021-08-05,000001,Vente,130000,,,CHAMP DE LA MARE,B102,71500,71056,Branges,71,,,710560000F1201,,,,,,,,,,,,,0,,,,,P,prés,,,300,5.133484,46.65399
2021-1195991,2021-08-05,000001,Vente,130000,985,,RUE DE BARBETE,0015,71500,71056,Branges,71,,,710560000F1204,,,,,,,,,,,,,0,,,,,S,sols,,,815,5.133479,46.653887
2021-1195999,2021-08-23,000001,Vente,1500,,,LES FAUSSES,B280,71500,71056,Branges,71,,,710560000E0016,,,,,,,,,,,,,0,,,,,P,prés,,,3470,5.164427,46.643169