id_mutation,date_mutation,numero_disposition,nature_mutation,valeur_fonciere,adresse_numero,adresse_suffixe,adresse_nom_voie,adresse_code_voie,code_postal,code_commune,nom_commune,code_departement,ancien_code_commune,ancien_nom_commune,id_parcelle,ancien_id_parcelle,numero_volume,lot1_numero,lot1_surface_carrez,lot2_numero,lot2_surface_carrez,lot3_numero,lot3_surface_carrez,lot4_numero,lot4_surface_carrez,lot5_numero,lot5_surface_carrez,nombre_lots,code_type_local,type_local,surface_reelle_bati,nombre_pieces_principales,code_nature_culture,nature_culture,code_nature_culture_speciale,nature_culture_speciale,surface_terrain,longitude,latitude
2021-1194699,2021-01-07,000001,Vente,224330,,,SEMON,B297,71480,71079,Champagnat,71,,,71079000AK0213,,,,,,,,,,,,,0,,,,,P,prés,,,2702,5.324954,46.501463
2021-1194699,2021-01-07,000001,Vente,224330,130,,RTE DE SEMON,0344,71480,71079,Champagnat,71,,,71079000AK0215,,,,,,,,,,,,,0,4,Local industriel. commercial ou assimilé,218,0,AG,terrains d'agrément,,,1139,5.325422,46.501345
2021-1194699,2021-01-07,000001,Vente,224330,130,,RTE DE SEMON,0344,71480,71079,Champagnat,71,,,71079000AK0215,,,,,,,,,,,,,0,4,Local industriel. commercial ou assimilé,218,0,S,sols,,,1000,5.325422,46.501345
2021-1194934,2021-02-19,000001,Vente,14000,,,CHAMP DE LA RIPPE,B054,71480,71079,Champagnat,71,,,71079000AI0141,,,,,,,,,,,,,0,,,,,BS,taillis sous futaie,,,12120,5.320309,46.490395
2021-1194934,2021-02-19,000001,Vente,14000,,,LA COTE,B108,71480,71079,Champagnat,71,,,71079000AI0142,,,,,,,,,,,,,0,,,,,P,prés,,,6830,5.320132,46.490906
2021-1194934,2021-02-19,000001,Vente,14000,,,LA COTE,B108,71480,71079,Champagnat,71,,,71079000AI0143,,,,,,,,,,,,,0,,,,,VI,vignes,,,810,5.320922,46.491111
2021-1194934,2021-02-19,000001,Vente,14000,,,LA COTE,B108,71480,71079,Champagnat,71,,,71079000AI0147,,,,,,,,,,,,,0,,,,,P,prés,,,15060,5.318392,46.492558
2021-1194934,2021-02-19,000001,Vente,14000,,,LA COTE,B108,71480,71079,Champagnat,71,,,71079000AI0182,,,,,,,,,,,,,0,,,,,T,terres,,,7034,5.320332,46.491511
2021-1194934,2021-02-19,000001,Vente,14000,,,LA COTE,B108,71480,71079,Champagnat,71,,,71079000AI0183,,,,,,,,,,,,,0,,,,,P,prés,,,10975,5.319338,46.491809
2021-1194934,2021-02-19,000001,Vente,14000,,,LA COTE,B108,71480,71079,Champagnat,71,,,71079000AI0198,,,,,,,,,,,,,0,,,,,T,terres,,,75,5.320078,46.492422
2021-1194934,2021-02-19,000001,Vente,14000,,,LA COTE,B108,71480,71079,Champagnat,71,,,71079000AI0214,,,,,,,,,,,,,0,,,,,T,terres,,,16890,5.318891,46.49335
2021-1195050,2021-03-12,000001,Vente,60,,,CLOS DE ROUSSEL,B092,71480,71079,Champagnat,71,,,710790000A0451,,,,,,,,,,,,,0,,,,,P,prés,,,180,5.37944,46.477833
2021-1195052,2021-03-19,000001,Vente,351,,,LA VILLE,B340,71480,71079,Champagnat,71,,,71079000AC0068,,,,,,,,,,,,,0,,,,,BT,taillis simples,,,191,5.381037,46.480943
2021-1195052,2021-03-19,000001,Vente,351,,,LA VILLE,B340,71480,71079,Champagnat,71,,,71079000AC0071,,,,,,,,,,,,,0,,,,,P,prés,,,160,5.380461,46.480436
2021-1195483,2021-06-03,000001,Vente,100000,250,,RTE DE VAUX,0400,71480,71079,Champagnat,71,,,71079000AC0231,,,,,,,,,,,,,0,1,Maison,55,2,S,sols,,,269,5.382444,46.477365
2021-1195483,2021-06-03,000001,Vente,100000,,,VAUX,B328,71480,71079,Champagnat,71,,,71079000AC0232,,,,,,,,,,,,,0,,,,,J,jardins,,,145,5.3823,46.477266
2021-1195483,2021-06-03,000001,Vente,100000,,,LA COMBE,B095,71480,71079,Champagnat,71,,,71079000AC0256,,,,,,,,,,,,,0,,,,,VE,vergers,,,330,5.382119,46.477036
2021-1195483,2021-06-03,000001,Vente,100000,,,LA COMBE,B095,71480,71079,Champagnat,71,,,71079000AC0257,,,,,,,,,,,,,0,,,,,VE,vergers,,,716,5.381886,46.477084
2021-1195607,2021-06-18,000001,Vente,16170,,,LES GRANDES TERRES,B184,71480,71079,Champagnat,71,,,710790000A1033,,,,,,,,,,,,,0,,,,,AB,terrains a bâtir,,,1155,5.380901,46.484111
2021-1195876,2021-07-23,000001,Vente,3000,,,CHAMP DE LA RIPPE,B054,71480,71079,Champagnat,71,,,71079000AI0141,,,,,,,,,,,,,0,,,,,BS,taillis sous futaie,,,12120,5.320309,46.490395
2021-1195880,2021-07-23,000001,Vente,13500,,,LA COTE,B108,71480,71079,Champagnat,71,,,71079000AI0142,,,,,,,,,,,,,0,,,,,P,prés,,,6830,5.320132,46.490906
2021-1195880,2021-07-23,000001,Vente,13500,,,LA COTE,B108,71480,71079,Champagnat,71,,,71079000AI0143,,,,,,,,,,,,,0,,,,,VI,vignes,,,810,5.320922,46.491111
2021-1195880,2021-07-23,000001,Vente,13500,,,LA COTE,B108,71480,71079,Champagnat,71,,,71079000AI0147,,,,,,,,,,,,,0,,,,,P,prés,,,15060,5.318392,46.492558
2021-1195880,2021-07-23,000001,Vente,13500,,,LA COTE,B108,71480,71079,Champagnat,71,,,71079000AI0182,,,,,,,,,,,,,0,,,,,T,terres,,,7034,5.320332,46.491511
2021-1195880,2021-07-23,000001,Vente,13500,,,LA COTE,B108,71480,71079,Champagnat,71,,,71079000AI0183,,,,,,,,,,,,,0,,,,,P,prés,,,10975,5.319338,46.491809
2021-1195880,2021-07-23,000001,Vente,13500,,,LA COTE,B108,71480,71079,Champagnat,71,,,71079000AI0214,,,,,,,,,,,,,0,,,,,T,terres,,,16890,5.318891,46.49335
2021-1195881,2021-07-23,000001,Vente,50,,,LA COTE,B108,71480,71079,Champagnat,71,,,71079000AI0198,,,,,,,,,,,,,0,,,,,T,terres,,,75,5.320078,46.492422
2021-1195934,2021-07-30,000001,Vente,145000,275,,RTE DE VAUX,0400,71480,71079,Champagnat,71,,,71079000AC0195,,,,,,,,,,,,,0,1,Maison,108,3,S,sols,,,90,5.382976,46.477339
2021-1195934,2021-07-30,000001,Vente,145000,5049,,RTE DE VAUX,0400,71480,71079,Champagnat,71,,,71079000AC0196,,,,,,,,,,,,,0,3,Dépendance,,0,S,sols,,,91,5.382902,46.477367
2021-1195934,2021-07-30,000001,Vente,145000,5049,,RTE DE VAUX,0400,71480,71079,Champagnat,71,,,71079000AC0196,,,,,,,,,,,,,0,3,Dépendance,,0,S,sols,,,91,5.382902,46.477367
2021-1195934,2021-07-30,000001,Vente,145000,5047,,RTE DE VAUX,0400,71480,71079,Champagnat,71,,,71079000AC0238,,,,,,,,,,,,,0,3,Dépendance,,0,S,sols,,,74,5.382703,46.477177
2021-1195934,2021-07-30,000001,Vente,145000,5047,,RTE DE VAUX,0400,71480,71079,Champagnat,71,,,71079000AC0238,,,,,,,,,,,,,0,3,Dépendance,,0,S,sols,,,74,5.382703,46.477177
2021-1195934,2021-07-30,000001,Vente,145000,,,VAUX,B328,71480,71079,Champagnat,71,,,71079000AC0345,,,,,,,,,,,,,0,,,,,S,sols,,,14,5.383062,46.477343
2021-1195934,2021-07-30,000001,Vente,145000,,,LES PLANTES,B244,71480,71079,Champagnat,71,,,710790000C0257,,,,,,,,,,,,,0,,,,,P,prés,,,790,5.385425,46.47532
2021-1195934,2021-07-30,000001,Vente,145000,,,LES PLANTES,B244,71480,71079,Champagnat,71,,,710790000C0258,,,,,,,,,,,,,0,,,,,P,prés,,,4914,5.386206,46.474913
2021-1195969,2021-08-17,000001,Vente,2700,,,CHAMP DE LA RIPPE,B054,71480,71079,Champagnat,71,,,71079000AI0140,,,,,,,,,,,,,0,,,,,BS,taillis sous futaie,,,7722,5.320001,46.489758
2021-1196383,2021-10-01,000002,Vente,2010,,,LE BOURG,B031,71480,71079,Champagnat,71,,,71079000AB0225,,,,,,,,,,,,,0,,,,,J,jardins,,,201,5.382201,46.483017
2021-1196546,2021-12-03,000001,Vente,600,,,CHAMP FERRINS,B063,71480,71079,Champagnat,71,,,710790000C0622,,,,,,,,,,,,,0,,,,,BR,futaies résineuses,,,5280,5.367596,46.468526
2021-1196726,2021-12-20,000001,Vente,150,,,LA CHAPELLE,B074,71480,71079,Champagnat,71,,,71079000AC0001,,,,,,,,,,,,,0,,,,,L,landes,FRICH,Friche,126,5.378221,46.481596
