id_mutation,date_mutation,numero_disposition,nature_mutation,valeur_fonciere,adresse_numero,adresse_suffixe,adresse_nom_voie,adresse_code_voie,code_postal,code_commune,nom_commune,code_departement,ancien_code_commune,ancien_nom_commune,id_parcelle,ancien_id_parcelle,numero_volume,lot1_numero,lot1_surface_carrez,lot2_numero,lot2_surface_carrez,lot3_numero,lot3_surface_carrez,lot4_numero,lot4_surface_carrez,lot5_numero,lot5_surface_carrez,nombre_lots,code_type_local,type_local,surface_reelle_bati,nombre_pieces_principales,code_nature_culture,nature_culture,code_nature_culture_speciale,nature_culture_speciale,surface_terrain,longitude,latitude
2021-1192469,2021-01-05,000002,Vente,135670,25,,RUE SAINT MARTIN,0260,71490,71149,Couches,71,,,71149000AC0369,,,,,,,,,,,,,0,1,Maison,190,6,S,sols,,,498,4.571783,46.870123
2021-1192469,2021-01-05,000002,Vente,135670,,,SAINT MARTIN,B290,71490,71149,Couches,71,,,71149000AC0581,,,,,,,,,,,,,0,,,,,AG,terrains d'agrément,,,22,4.571664,46.87
2021-1192469,2021-01-05,000002,Vente,135670,3,,RUE CHAMERON,0080,71490,71149,Couches,71,,,71149000AC0583,,,,,,,,,,,,,0,,,,,S,sols,,,316,4.571557,46.870106
2021-1192525,2021-02-02,000001,Echange,2844,,,LES CRETS,B100,71490,71149,Couches,71,,,711490000F0257,,,,,,,,,,,,,0,,,,,P,prés,,,2132,4.571684,46.851774
2021-1192525,2021-02-02,000001,Echange,2844,,,LES CRETS,B100,71490,71149,Couches,71,,,711490000F0260,,,,,,,,,,,,,0,,,,,T,terres,,,3260,4.570755,46.851289
2021-1192525,2021-02-02,000001,Echange,2844,,,LES CRETS,B100,71490,71149,Couches,71,,,711490000F0261,,,,,,,,,,,,,0,,,,,T,terres,,,295,4.570247,46.851513
2021-1192527,2021-02-02,000001,Echange,3267,,,CHAMP DERRIERE,B051,71490,71149,Couches,71,,,71149000AK0138,,,,,,,,,,,,,0,,,,,VI,vignes,,,6533,4.573812,46.855003
2021-1192590,2021-02-18,000001,Vente,35000,,,LA VARENNE,B319,71490,71149,Couches,71,,,71149000AC0014,,,,,,,,,,,,,0,,,,,J,jardins,,,430,4.568674,46.871679
2021-1192590,2021-02-18,000001,Vente,35000,3,,RUE DE VARENNE,0310,71490,71149,Couches,71,,,71149000AC0015,,,,,,,,,,,,,0,1,Maison,86,4,S,sols,,,217,4.568768,46.871581
2021-1192678,2021-02-16,000001,Vente,109947,,,LES BATEES,B012,71490,71149,Couches,71,,,71149000ZD0024,,,,,,,,,,,,,0,,,,,T,terres,,,32242,4.610907,46.855465
2021-1192745,2021-03-08,000001,Vente terrain à bâtir,52890,,,LE MAUREPOUX,B183,71490,71149,Couches,71,,,711490000B0431,,,,,,,,,,,,,0,,,,,AB,terrains a bâtir,,,1290,4.577104,46.872501
2021-1192763,2021-03-05,000001,Vente,34000,10,,RUE SAINT NICOLAS,0280,71490,71149,Couches,71,,,71149000AD0179,,,,,,,,,,,,,0,1,Maison,80,4,S,sols,,,200,4.576778,46.86825
2021-1192823,2021-03-29,000001,Echange,2000,,,LES CHAMPS DEVANT,B074,71490,71149,Couches,71,,,711490000E0163,,,,,,,,,,,,,0,,,,,T,terres,,,1484,4.588631,46.860784
2021-1192823,2021-03-29,000002,Echange,2000,,,LE CHATEAU,B080,71490,71149,Couches,71,,,71149000AH0231,,,,,,,,,,,,,0,,,,,P,prés,,,2628,4.583315,46.8625
2021-1192837,2021-03-16,000001,Vente,1500,,,LES BOIS DE BOUHY,B017,71490,71149,Couches,71,,,711490000C0688,,,,,,,,,,,,,0,,,,,VI,vignes,VAOC,Vins d'appellation d'origine contrôlée,853,4.586633,46.871208
2021-1192838,2021-03-22,000001,Echange,3900,,,ORIGNY,B199,71490,71149,Couches,71,,,71149000AI0006,,,,,,,,,,,,,0,,,,,P,prés,,,2215,4.577702,46.855276
2021-1192838,2021-03-22,000002,Echange,3900,,,CHAMP DESSOUS,B057,71490,71149,Couches,71,,,71149000AI0149,,,,,,,,,,,,,0,,,,,P,prés,,,18055,4.578437,46.853029
2021-1192838,2021-03-22,000003,Echange,3900,,,CHAMP DESSOUS,B057,71490,71149,Couches,71,,,71149000AI0146,,,,,,,,,,,,,0,,,,,P,prés,,,1552,4.578869,46.852316
2021-1192838,2021-03-22,000004,Echange,3900,,,ORIGNY,B199,71490,71149,Couches,71,,,71149000AI0066,,,,,,,,,,,,,0,,,,,P,prés,,,832,4.575554,46.853586
2021-1192838,2021-03-22,000004,Echange,3900,,,PRE D HIVER,B246,71490,71149,Couches,71,,,711490000F0154,,,,,,,,,,,,,0,,,,,P,prés,,,4105,4.577008,46.852558
2021-1192838,2021-03-22,000004,Echange,3900,,,VIGNE DES ROCHES,B336,71490,71149,Couches,71,,,711490000F0217,,,,,,,,,,,,,0,,,,,P,prés,,,4292,4.574515,46.85017
2021-1192838,2021-03-22,000004,Echange,3900,,,VIGNE DES ROCHES,B336,71490,71149,Couches,71,,,711490000F0231,,,,,,,,,,,,,0,,,,,T,terres,,,2705,4.57318,46.85016
2021-1192838,2021-03-22,000004,Echange,3900,,,LE CARREAU,B036,71490,71149,Couches,71,,,711490000I0356,,,,,,,,,,,,,0,,,,,BT,taillis simples,,,900,4.57061,46.859517
2021-1192838,2021-03-22,000004,Echange,3900,,,LE CARREAU,B036,71490,71149,Couches,71,,,711490000I0357,,,,,,,,,,,,,0,,,,,P,prés,,,4403,4.570673,46.859187
2021-1192839,2021-03-19,000001,Vente,25000,25,,GR GRANDE RUE,0155,71490,71149,Couches,71,,,71149000AC0209,,,,,,,,,,,,,0,1,Maison,114,4,S,sols,,,149,4.574662,46.869211
2021-1192917,2021-04-22,000001,Vente,66000,82,,RUE DE VARENNE,0310,71490,71149,Couches,71,,,711490000B0378,,,,,,,,,,,,,0,4,Local industriel. commercial ou assimilé,176,0,S,sols,,,1134,4.560816,46.876468
2021-1192969,2021-04-20,000001,Vente,12180,,,CHALENCEY,B038,71490,71149,Couches,71,,,71149000AH0022,,,,,,,,,,,,,0,,,,,P,prés,,,677,4.582937,46.858916
2021-1192969,2021-04-20,000001,Vente,12180,,,CHALENCEY,B038,71490,71149,Couches,71,,,71149000AH0024,,,,,,,,,,,,,0,,,,,S,sols,,,338,4.58286,46.858741
2021-1193011,2021-04-26,000001,Vente,100000,,,COMBEREAU,B090,71490,71149,Couches,71,,,711490000G0268,,,,,,,,,,,,,0,,,,,J,jardins,,,194,4.554299,46.857773
2021-1193011,2021-04-26,000001,Vente,100000,,,COMBEREAU,B090,71490,71149,Couches,71,,,711490000G0269,,,,,,,,,,,,,0,,,,,S,sols,,,32,4.554133,46.85782
2021-1193011,2021-04-26,000001,Vente,100000,5614,,COMBEREAU,B090,71490,71149,Couches,71,,,711490000G0270,,,,,,,,,,,,,0,1,Maison,150,5,S,sols,,,211,4.554121,46.857758
2021-1193024,2021-04-30,000001,Vente,60000,,,ORIGNY,B199,71490,71149,Couches,71,,,71149000AK0162,,,,,,,,,,,,,0,,,,,J,jardins,,,618,,
2021-1193024,2021-04-30,000001,Vente,60000,,,ORIGNY,B199,71490,71149,Couches,71,,,71149000AK0163,,,,,,,,,,,,,0,,,,,P,prés,,,1413,4.574574,46.854629
2021-1193024,2021-04-30,000001,Vente,60000,,,ORIGNY,B199,71490,71149,Couches,71,,,71149000AK0164,,,,,,,,,,,,,0,,,,,S,sols,,,340,4.575133,46.854434
2021-1193024,2021-04-30,000001,Vente,60000,5546,,ORIGNY,B199,71490,71149,Couches,71,,,71149000AK0165,,,,,,,,,,,,,0,2,Appartement,56,3,S,sols,,,664,4.574913,46.854363
2021-1193024,2021-04-30,000001,Vente,60000,5546,,ORIGNY,B199,71490,71149,Couches,71,,,71149000AK0165,,,,,,,,,,,,,0,2,Appartement,56,3,S,sols,,,664,4.574913,46.854363
2021-1193024,2021-04-30,000001,Vente,60000,,,PRE DE LA COUR,B239,71490,71149,Couches,71,,,71149000AK0166,,,,,,,,,,,,,0,,,,,VI,vignes,VAOC,Vins d'appellation d'origine contrôlée,600,4.574477,46.854378
2021-1193024,2021-04-30,000001,Vente,60000,,,PRE DE LA COUR,B239,71490,71149,Couches,71,,,71149000AK0166,,,,,,,,,,,,,0,,,,,VI,vignes,,,2908,4.574477,46.854378
2021-1193031,2021-04-22,000001,Vente,487184,,,LA BONNEAU,B027,71490,71149,Couches,71,,,711490000F0482,,,,,,,,,,,,,0,,,,,BT,taillis simples,,,600,4.554127,46.851853
2021-1193031,2021-04-22,000001,Vente,487184,,,LA BONNEAU,B027,71490,71149,Couches,71,,,711490000F0483,,,,,,,,,,,,,0,,,,,AG,terrains d'agrément,,,1000,4.553928,46.852428
2021-1193031,2021-04-22,000001,Vente,487184,,,LA BONNEAU,B027,71490,71149,Couches,71,,,711490000F0483,,,,,,,,,,,,,0,,,,,BT,taillis simples,,,3000,4.553928,46.852428
2021-1193031,2021-04-22,000001,Vente,487184,,,LA BONNEAU,B027,71490,71149,Couches,71,,,711490000F0483,,,,,,,,,,,,,0,,,,,J,jardins,,,1306,4.553928,46.852428
2021-1193031,2021-04-22,000001,Vente,487184,5603,,LA BONNEAU,B027,71490,71149,Couches,71,,,711490000F0484,,,,,,,,,,,,,0,1,Maison,224,7,S,sols,,,2360,4.55329,46.852162
2021-1193031,2021-04-22,000001,Vente,487184,5603,,LA BONNEAU,B027,71490,71149,Couches,71,,,711490000F0484,,,,,,,,,,,,,0,3,Dépendance,,0,S,sols,,,2360,4.55329,46.852162
2021-1193031,2021-04-22,000001,Vente,487184,,,LA BONNEAU,B027,71490,71149,Couches,71,,,711490000F0485,,,,,,,,,,,,,0,,,,,T,terres,,,1640,4.552858,46.852448
2021-1193031,2021-04-22,000001,Vente,487184,,,LA BONNEAU,B027,71490,71149,Couches,71,,,711490000F0488,,,,,,,,,,,,,0,,,,,BT,taillis simples,,,4900,4.553378,46.853023
2021-1193031,2021-04-22,000001,Vente,487184,,,LA BONNEAU,B027,71490,71149,Couches,71,,,711490000F0489,,,,,,,,,,,,,0,,,,,BT,taillis simples,,,60,4.553174,46.853411
2021-1193080,2021-05-03,000001,Vente,30000,,,SAINT NICOLAS,B291,71490,71149,Couches,71,,,71149000AD0213,,,,,,,,,,,,,0,,,,,S,sols,,,40,4.577655,46.867891
2021-1193080,2021-05-03,000001,Vente,30000,,,SAINT NICOLAS,B291,71490,71149,Couches,71,,,71149000AD0216,,,,,,,,,,,,,0,,,,,J,jardins,,,400,4.578145,46.868407
2021-1193080,2021-05-03,000001,Vente,30000,29,,RUE SAINT NICOLAS,0280,71490,71149,Couches,71,,,71149000AD0272,,,,,,,,,,,,,0,1,Maison,92,3,S,sols,,,45,4.577765,46.868113
2021-1193080,2021-05-03,000001,Vente,30000,29,,RUE SAINT NICOLAS,0280,71490,71149,Couches,71,,,71149000AD0273,,,,,,,,,,,,,0,,,,,S,sols,,,65,4.577576,46.867974
2021-1193080,2021-05-03,000001,Vente,30000,,,RUE SAINT NICOLAS,0280,71490,71149,Couches,71,,,71149000AD0276,,,,,,,,,,,,,0,,,,,S,sols,,,398,4.57773,46.867975
2021-1193123,2021-05-20,000001,Vente,6250,14,,RUE DU CHATEAU,0085,71490,71149,Couches,71,,,71149000AH0151,,,,,,,,,,,,,0,3,Dépendance,,0,S,sols,,,52,4.585421,46.862086
2021-1193157,2021-05-28,000002,Echange,300,,,SAINT MARTIN,B290,71490,71149,Couches,71,,,71149000AC0587,,,,,,,,,,,,,0,,,,,J,jardins,,,32,4.572525,46.870861
2021-1193157,2021-05-28,000003,Echange,300,,,VERS LE PRE BRETET,B329,71490,71149,Couches,71,,,71149000AC0584,,,,,,,,,,,,,0,,,,,J,jardins,,,60,4.572395,46.871005
2021-1193158,2021-05-21,000002,Vente,370,,,LES BARRES,B218,71490,71149,Couches,71,,,711490000E0862,,,,,,,,,,,,,0,,,,,T,terres,,,1046,4.583251,46.863505
2021-1193158,2021-05-21,000002,Vente,370,,,LES BARRES,B218,71490,71149,Couches,71,,,711490000E0864,,,,,,,,,,,,,0,,,,,T,terres,,,171,4.583309,46.863378
2021-1193158,2021-05-21,000003,Vente,370,,,LES BARRES,B218,71490,71149,Couches,71,,,711490000E0856,,,,,,,,,,,,,0,,,,,T,terres,,,200,4.581965,46.862961
2021-1193158,2021-05-21,000003,Vente,370,,,LES BARRES,B218,71490,71149,Couches,71,,,711490000E0858,,,,,,,,,,,,,0,,,,,T,terres,,,589,4.582311,46.863187
2021-1193158,2021-05-21,000003,Vente,370,,,LES BARRES,B218,71490,71149,Couches,71,,,711490000E0860,,,,,,,,,,,,,0,,,,,T,terres,,,474,4.582658,46.863434
2021-1193165,2021-05-19,000001,Vente,13000,1,,RUE DE LA TANNERIE,0300,71490,71149,Couches,71,,,71149000AC0257,,,,,,,,,,,,,0,1,Maison,24,2,S,sols,,,49,4.575058,46.868812
2021-1193165,2021-05-19,000001,Vente,13000,,,RUE DE LA TANNERIE,0300,71490,71149,Couches,71,,,71149000AC0464,,,,,,,,,,,,,0,,,,,S,sols,,,29,4.574967,46.868756
2021-1193237,2021-06-08,000001,Vente,10000,5049,,RUE DE VARENNE,0310,71490,71149,Couches,71,,,71149000AB0113,,,,,,,,,,,,,0,1,Maison,36,1,S,sols,,,118,4.567382,46.874312
2021-1193237,2021-06-08,000001,Vente,10000,,,LA VARENNE,B319,71490,71149,Couches,71,,,71149000AB0117,,,,,,,,,,,,,0,,,,,J,jardins,,,415,4.567654,46.874562
2021-1193264,2021-05-28,000001,Vente,102000,,,VERS LE PRE BRETET,B329,71490,71149,Couches,71,,,71149000AC0120,,,,,,,,,,,,,0,,,,,T,terres,,,348,4.572382,46.871221
2021-1193264,2021-05-28,000001,Vente,102000,,,SAINT MARTIN,B290,71490,71149,Couches,71,,,71149000AC0132,,,,,,,,,,,,,0,,,,,S,sols,,,480,4.572676,46.870918
2021-1193264,2021-05-28,000001,Vente,102000,5,,RUE DES SOEURS,0290,71490,71149,Couches,71,,,71149000AC0133,,,,,,,,,,,,,0,3,Dépendance,,0,S,sols,,,472,4.572743,46.870757
2021-1193264,2021-05-28,000001,Vente,102000,5,,RUE DES SOEURS,0290,71490,71149,Couches,71,,,71149000AC0133,,,,,,,,,,,,,0,1,Maison,92,6,S,sols,,,472,4.572743,46.870757
2021-1193264,2021-05-28,000001,Vente,102000,5,,RUE DES SOEURS,0290,71490,71149,Couches,71,,,71149000AC0133,,,,,,,,,,,,,0,3,Dépendance,,0,S,sols,,,472,4.572743,46.870757
2021-1193264,2021-05-28,000001,Vente,102000,3,,RUE DES SOEURS,0290,71490,71149,Couches,71,,,71149000AC0134,,,,,,,,,,,,,0,1,Maison,70,2,S,sols,,,120,4.572561,46.870744
2021-1193264,2021-05-28,000001,Vente,102000,,,VERS LE PRE BRETET,B329,71490,71149,Couches,71,,,71149000AC0585,,,,,,,,,,,,,0,,,,,J,jardins,,,350,4.572527,46.87107
2021-1193264,2021-05-28,000001,Vente,102000,,,SAINT MARTIN,B290,71490,71149,Couches,71,,,71149000AC0587,,,,,,,,,,,,,0,,,,,J,jardins,,,32,4.572525,46.870861
2021-1193318,2021-01-19,000001,Adjudication,60100,4,,RUE SAINT GEORGES,0240,71490,71149,Couches,71,,,71149000AD0307,,,,,,,,,,,,,0,1,Maison,160,5,S,sols,,,205,4.574072,46.868062
2021-1193319,2021-06-23,000001,Vente,40000,,,LA CREUSE,B101,71490,71149,Couches,71,,,71149000AE0082,,,,,,,,,,,,,0,,,,,S,sols,,,111,4.593831,46.863808
2021-1193319,2021-06-23,000001,Vente,40000,,,LA CREUSE,B101,71490,71149,Couches,71,,,71149000AE0085,,,,,,,,,,,,,0,,,,,P,prés,,,3805,4.594338,46.864085
2021-1193319,2021-06-23,000001,Vente,40000,,,LA CREUSE,B101,71490,71149,Couches,71,,,71149000AE0094,,,,,,,,,,,,,0,,,,,T,terres,,,209,4.595038,46.864018
2021-1193360,2021-06-16,000001,Vente,104420,8,A,RUE DES SOURCES,0295,71490,71149,Couches,71,,,71149000AH0129,,,,,,,,,,,,,0,1,Maison,21,0,S,sols,,,270,4.584239,46.862098
2021-1193360,2021-06-16,000001,Vente,104420,8,,RUE DES SOURCES,0295,71490,71149,Couches,71,,,71149000AH0130,,,,,,,,,,,,,0,1,Maison,77,2,S,sols,,,393,4.584314,46.862143
2021-1193360,2021-06-16,000001,Vente,104420,,,LE CHATEAU,B080,71490,71149,Couches,71,,,71149000AH0230,,,,,,,,,,,,,0,,,,,P,prés,,,1138,4.584067,46.862424
2021-1193440,2021-06-22,000001,Vente,25000,,,CHAMPS DES OIES,B072,71490,71149,Couches,71,,,711490000C0255,,,,,,,,,,,,,0,,,,,T,terres,,,1200,4.597028,46.870447
2021-1193440,2021-06-22,000001,Vente,25000,,,NINIOLE,B196,71490,71149,Couches,71,,,711490000C0352,,,,,,,,,,,,,0,,,,,P,prés,,,2100,4.601575,46.867207
2021-1193440,2021-06-22,000001,Vente,25000,,,NINIOLE,B196,71490,71149,Couches,71,,,711490000C0358,,,,,,,,,,,,,0,,,,,P,prés,,,478,4.604436,46.86791
2021-1193440,2021-06-22,000001,Vente,25000,23,,RUE DU PONT LEVIS,2370,71490,71149,Couches,71,,,711490000C0359,,,,,,,,,,,,,0,1,Maison,50,2,S,sols,,,703,4.60502,46.867817
2021-1193440,2021-06-22,000001,Vente,25000,,,NINIOLE,B196,71490,71149,Couches,71,,,711490000C0360,,,,,,,,,,,,,0,,,,,T,terres,,,6732,4.604644,46.867089
2021-1193440,2021-06-22,000001,Vente,25000,,,NINIOLE,B196,71490,71149,Couches,71,,,711490000C0361,,,,,,,,,,,,,0,,,,,P,prés,,,8087,4.603751,46.867452
2021-1193445,2021-06-21,000001,Vente,73000,7,,RUE DE LA TANNERIE,0300,71490,71149,Couches,71,,,71149000AC0224,,,,,,,,,,,,,0,1,Maison,114,4,S,sols,,,157,4.575673,46.869377
2021-1193468,2021-06-25,000001,Vente,19000,32,,RUE DE VARENNE,0310,71490,71149,Couches,71,,,71149000AB0282,,,,,,,,,,,,,0,1,Maison,29,1,S,sols,,,291,4.567936,46.874154
2021-1193468,2021-06-25,000002,Vente,19000,32,,RUE DE VARENNE,0310,71490,71149,Couches,71,,,71149000AB0099,,,,,,,,,,,,,0,1,Maison,36,3,S,sols,,,330,4.56801,46.874127
2021-1193487,2021-07-01,000001,Vente,18000,17,,RUE SAINT GEORGES,0240,71490,71149,Couches,71,,,71149000AC0247,,,,,,,,,,,,,0,3,Dépendance,,0,S,sols,,,290,4.575337,46.868484
2021-1193487,2021-07-01,000001,Vente,18000,17,,RUE SAINT GEORGES,0240,71490,71149,Couches,71,,,71149000AC0247,,,,,,,,,,,,,0,1,Maison,110,5,S,sols,,,290,4.575337,46.868484
2021-1193533,2021-07-06,000001,Vente,160000,4,,IMP DES VIOLETTES,0333,71490,71149,Couches,71,,,711490000C0773,,,,,,,,,,,,,0,1,Maison,70,3,S,sols,,,960,4.57994,46.870304
2021-1193533,2021-07-06,000001,Vente,160000,,,IMP DES VIOLETTES,0333,71490,71149,Couches,71,,,711490000C0776,,,,,,,,,,,,,0,,,,,VI,vignes,,,1388,4.580137,46.870239
2021-1193533,2021-07-06,000001,Vente,160000,,,IMP DES VIOLETTES,0333,71490,71149,Couches,71,,,711490000C0777,,,,,,,,,,,,,0,,,,,T,terres,,,1275,4.580411,46.870449
2021-1193622,2021-08-02,000001,Vente,198500,,,LE CARREAU,B036,71490,71149,Couches,71,,,711490000I0363,,,,,,,,,,,,,0,,,,,T,terres,,,643,4.570085,46.857164
2021-1193622,2021-08-02,000001,Vente,198500,2,,RUE DES SOLEILS,2770,71490,71149,Couches,71,,,711490000I0449,,,,,,,,,,,,,0,1,Maison,127,5,J,jardins,,,1500,4.569935,46.857232
2021-1193622,2021-08-02,000001,Vente,198500,2,,RUE DES SOLEILS,2770,71490,71149,Couches,71,,,711490000I0449,,,,,,,,,,,,,0,1,Maison,127,5,S,sols,,,500,4.569935,46.857232
2021-1193692,2021-07-22,000001,Vente,125600,31,,RUE DE VARENNE,0310,71490,71149,Couches,71,,,71149000AB0291,,,,,,,,,,,,,0,1,Maison,87,3,J,jardins,,,773,4.564801,46.874797
2021-1193692,2021-07-22,000001,Vente,125600,31,,RUE DE VARENNE,0310,71490,71149,Couches,71,,,71149000AB0291,,,,,,,,,,,,,0,1,Maison,87,3,S,sols,,,500,4.564801,46.874797
2021-1193769,2021-08-24,000001,Vente,4000,,,SUR LES MOULINS,B193,71490,71149,Couches,71,,,711490000C0802,,,,,,,,,,,,,0,,,,,BT,taillis simples,,,6043,4.587373,46.865122
2021-1193769,2021-08-24,000001,Vente,4000,,,LA BARAQUE,B005,71490,71149,Couches,71,,,711490000E0033,,,,,,,,,,,,,0,,,,,BT,taillis simples,,,1900,4.588071,46.864918
2021-1193769,2021-08-24,000001,Vente,4000,,,LA BARAQUE,B005,71490,71149,Couches,71,,,711490000E0798,,,,,,,,,,,,,0,,,,,L,landes,FRICH,Friche,448,4.586986,46.865042
2021-1193769,2021-08-24,000001,Vente,4000,,,LA BARAQUE,B005,71490,71149,Couches,71,,,711490000E0798,,,,,,,,,,,,,0,,,,,S,sols,,,188,4.586986,46.865042
2021-1193818,2021-09-02,000001,Vente,40000,9,,RUE DE L'HOPITAL,0160,71490,71149,Couches,71,,,71149000AC0228,,,,,,,,,,,,,0,1,Maison,75,2,S,sols,,,400,4.576053,46.86944
2021-1193899,2021-09-07,000001,Vente,20000,,,COMBEREAU,B090,71490,71149,Couches,71,,,711490000G0265,,,,,,,,,,,,,0,,,,,J,jardins,,,167,4.554378,46.857527
2021-1193899,2021-09-07,000002,Vente,20000,,,COMBEREAU,B090,71490,71149,Couches,71,,,711490000G0263,,,,,,,,,,,,,0,,,,,S,sols,,,125,4.554208,46.857383
2021-1193899,2021-09-07,000002,Vente,20000,,,COMBEREAU,B090,71490,71149,Couches,71,,,711490000G0264,,,,,,,,,,,,,0,,,,,J,jardins,,,184,4.554144,46.857497
2021-1193899,2021-09-07,000002,Vente,20000,,,COMBEREAU,B090,71490,71149,Couches,71,,,711490000G0266,,,,,,,,,,,,,0,,,,,P,prés,,,430,4.554385,46.857627
2021-1193899,2021-09-07,000002,Vente,20000,12,,RUE DU CHAMP DE LA GRANGE,0700,71490,71149,Couches,71,,,711490000G0271,,,,,,,,,,,,,0,1,Maison,68,3,S,sols,,,296,4.55408,46.857678
2021-1193936,2021-09-10,000001,Vente,220000,5,,RUE DU CREUX DE LA MINE,1000,71490,71149,Couches,71,,,71149000AH0037,,,,,,,,,,,,,0,1,Maison,130,6,S,sols,,,947,4.582666,46.858125
2021-1193936,2021-09-10,000001,Vente,220000,5,,RUE DU CREUX DE LA MINE,1000,71490,71149,Couches,71,,,71149000AH0037,,,,,,,,,,,,,0,3,Dépendance,,0,S,sols,,,947,4.582666,46.858125
2021-1193936,2021-09-10,000001,Vente,220000,,,CHALENCEY,B038,71490,71149,Couches,71,,,71149000AH0039,,,,,,,,,,,,,0,,,,,P,prés,,,1168,4.582945,46.858223
2021-1193936,2021-09-10,000001,Vente,220000,,,CHALENCEY,B038,71490,71149,Couches,71,,,71149000AH0051,,,,,,,,,,,,,0,,,,,J,jardins,,,425,4.58301,46.85797
2021-1193990,2021-09-27,000001,Vente,2400,,,LES ROCHES,B271,71490,71149,Couches,71,,,711490000F0243,,,,,,,,,,,,,0,,,,,T,terres,,,4587,4.57225,46.850356
2021-1193990,2021-09-27,000001,Vente,2400,,,LES FOURNEAUX,B131,71490,71149,Couches,71,,,711490000I0354,,,,,,,,,,,,,0,,,,,P,prés,,,7370,4.567543,46.860745
2021-1193990,2021-09-27,000001,Vente,2400,,,LES FOURNEAUX,B131,71490,71149,Couches,71,,,711490000I0371,,,,,,,,,,,,,0,,,,,P,prés,,,5827,4.567094,46.860278
2021-1194022,2021-10-14,000002,Vente,2000,4,,LE PONT DE VIGNY,B235,71490,71149,Couches,71,,,71149000AC0589,,,,,,,,,,,,,0,,,,,S,sols,,,42,4.56932,46.870499
2021-1194045,2021-09-28,000001,Vente,52770,5560,,EGUILLY,B117,71490,71149,Couches,71,,,71149000AK0075,,,,,,,,,,,,,0,1,Maison,60,2,S,sols,,,44,4.570253,46.855817
2021-1194045,2021-09-28,000001,Vente,52770,,,EGUILLY,B117,71490,71149,Couches,71,,,71149000AK0076,,,,,,,,,,,,,0,,,,,S,sols,,,393,4.570391,46.855918
2021-1194074,2021-10-06,000001,Vente,1000,,,PATURE ROBERT,B214,71490,71149,Couches,71,,,711490000G0487,,,,,,,,,,,,,0,,,,,BT,taillis simples,,,5410,4.53384,46.868448
2021-1194096,2021-10-12,000001,Vente,231000,,,TERRE SUR LA ROUTE,B310,71490,71149,Couches,71,,,711490000H0141,,,,,,,,,,,,,0,,,,,P,prés,,,169,4.55618,46.876476
2021-1194096,2021-10-12,000001,Vente,231000,,,LES PRES DE L ECHENAUD,B259,71490,71149,Couches,71,,,711490000H0143,,,,,,,,,,,,,0,,,,,BT,taillis simples,,,5486,4.5571,46.876263
2021-1194096,2021-10-12,000001,Vente,231000,,,LES PRES DE L ECHENAUD,B259,71490,71149,Couches,71,,,711490000H0143,,,,,,,,,,,,,0,,,,,E,eaux,ETANG,Etangs,4560,4.5571,46.876263
2021-1194096,2021-10-12,000001,Vente,231000,39,,RUE DE VARENNE,0310,71490,71149,Couches,71,,,711490000H0146,,,,,,,,,,,,,0,4,Local industriel. commercial ou assimilé,5000,0,S,sols,,,134,4.558958,46.875355
2021-1194096,2021-10-12,000001,Vente,231000,39,,RUE DE VARENNE,0310,71490,71149,Couches,71,,,711490000H0146,,,,,,,,,,,,,0,4,Local industriel. commercial ou assimilé,5000,0,P,prés,,,10128,4.558958,46.875355
2021-1194096,2021-10-12,000001,Vente,231000,39,,RUE DE VARENNE,0310,71490,71149,Couches,71,,,711490000H0148,,,,,,,,,,,,,0,4,Local industriel. commercial ou assimilé,177,0,T,terres,,,3326,4.558667,46.875986
2021-1194096,2021-10-12,000001,Vente,231000,39,,RUE DE VARENNE,0310,71490,71149,Couches,71,,,711490000H0148,,,,,,,,,,,,,0,4,Local industriel. commercial ou assimilé,177,0,S,sols,,,100,4.558667,46.875986
2021-1194096,2021-10-12,000001,Vente,231000,,,LES PRES DE L ECHENAUD,B259,71490,71149,Couches,71,,,711490000H0150,,,,,,,,,,,,,0,,,,,BT,taillis simples,,,2220,4.558438,46.875787
2021-1194096,2021-10-12,000001,Vente,231000,,,LES PRES DE L ECHENAUD,B259,71490,71149,Couches,71,,,711490000H0150,,,,,,,,,,,,,0,,,,,T,terres,,,2218,4.558438,46.875787
2021-1194161,2021-10-15,000001,Vente,246000,,,RUE SAINT GEORGES,0240,71490,71149,Couches,71,,,71149000AD0163,,,,,,,,,,,,,0,,,,,J,jardins,,,760,4.575606,46.867858
2021-1194161,2021-10-15,000001,Vente,246000,5367,,RUE SAINT GEORGES,0240,71490,71149,Couches,71,,,71149000AD0164,,,,,,,,,,,,,0,1,Maison,180,6,S,sols,,,312,4.575415,46.868094
2021-1194161,2021-10-15,000001,Vente,246000,5367,,RUE SAINT GEORGES,0240,71490,71149,Couches,71,,,71149000AD0164,,,,,,,,,,,,,0,3,Dépendance,,0,S,sols,,,312,4.575415,46.868094
2021-1194161,2021-10-15,000001,Vente,246000,5367,,RUE SAINT GEORGES,0240,71490,71149,Couches,71,,,71149000AD0164,,,,,,,,,,,,,0,3,Dépendance,,0,S,sols,,,312,4.575415,46.868094
2021-1194162,2021-10-14,000001,Vente,4500,1,,RUE DE VARENNE,0310,71490,71149,Couches,71,,,71149000AC0016,,,,,,,,,,,,,0,1,Maison,77,3,S,sols,,,200,4.568777,46.871498
2021-1194162,2021-10-14,000001,Vente,4500,,,LA VARENNE,B319,71490,71149,Couches,71,,,71149000AC0017,,,,,,,,,,,,,0,,,,,J,jardins,,,257,4.56855,46.871569
2021-1194193,2021-10-19,000001,Vente,145650,8,,RUE DES ROCHES ROBINS,0219,71490,71149,Couches,71,,,711490000C0865,,,,,,,,,,,,,0,1,Maison,88,4,S,sols,,,185,4.580602,46.870843
2021-1194193,2021-10-19,000001,Vente,145650,,,LES GOUTELAINES,B144,71490,71149,Couches,71,,,711490000C0871,,,,,,,,,,,,,0,,,,,AB,terrains a bâtir,,,479,4.580661,46.870765
2021-1194194,2021-10-20,000002,Vente,65000,20,,RUE DE VARENNE,0310,71490,71149,Couches,71,,,71149000AB0262,,,,,,,,,,,,,0,1,Maison,104,5,J,jardins,,,568,4.568735,46.873291
2021-1194194,2021-10-20,000002,Vente,65000,20,,RUE DE VARENNE,0310,71490,71149,Couches,71,,,71149000AB0262,,,,,,,,,,,,,0,1,Maison,104,5,S,sols,,,329,4.568735,46.873291
2021-1194194,2021-10-20,000002,Vente,65000,,,LA VARENNE,B319,71490,71149,Couches,71,,,71149000AB0336,,,,,,,,,,,,,0,,,,,T,terres,,,725,4.569225,46.873284
2021-1194195,2021-10-20,000001,Vente,300,,,LA VARENNE,B319,71490,71149,Couches,71,,,71149000AB0337,,,,,,,,,,,,,0,,,,,T,terres,,,168,4.569295,46.87301
2021-1194279,2021-11-12,000001,Vente,260000,,,ORIGNY,B199,71490,71149,Couches,71,,,71149000AK0157,,,,,,,,,,,,,0,,,,,J,jardins,,,468,4.575182,46.854801
2021-1194279,2021-11-12,000001,Vente,260000,5544,,ORIGNY,B199,71490,71149,Couches,71,,,71149000AK0158,,,,,,,,,,,,,0,1,Maison,89,3,S,sols,,,184,4.575463,46.854694
2021-1194279,2021-11-12,000001,Vente,260000,,,ORIGNY,B199,71490,71149,Couches,71,,,71149000AK0159,,,,,,,,,,,,,0,,,,,S,sols,,,238,4.575311,46.854698