id_mutation,date_mutation,numero_disposition,nature_mutation,valeur_fonciere,adresse_numero,adresse_suffixe,adresse_nom_voie,adresse_code_voie,code_postal,code_commune,nom_commune,code_departement,ancien_code_commune,ancien_nom_commune,id_parcelle,ancien_id_parcelle,numero_volume,lot1_numero,lot1_surface_carrez,lot2_numero,lot2_surface_carrez,lot3_numero,lot3_surface_carrez,lot4_numero,lot4_surface_carrez,lot5_numero,lot5_surface_carrez,nombre_lots,code_type_local,type_local,surface_reelle_bati,nombre_pieces_principales,code_nature_culture,nature_culture,code_nature_culture_speciale,nature_culture_speciale,surface_terrain,longitude,latitude
2021-1180931,2021-01-05,000001,Vente,340600,106,,ALL DES MIOLANDS,0389,71870,71235,Hurigny,71,,,71235000AP0131,,,,,,,,,,,,,0,3,Dépendance,,0,S,sols,,,899,4.793038,46.342788
2021-1180931,2021-01-05,000001,Vente,340600,106,,ALL DES MIOLANDS,0389,71870,71235,Hurigny,71,,,71235000AP0131,,,,,,,,,,,,,0,1,Maison,140,5,S,sols,,,899,4.793038,46.342788
2021-1181009,2021-01-19,000001,Vente,62000,,,RTE DE MACON,0370,71870,71235,Hurigny,71,,,71235000AR0251,,,,,,,,,,,,,0,,,,,AB,terrains a bâtir,,,717,4.791382,46.348756
2021-1181178,2021-02-12,000001,Vente,95000,50,,ALL DES GANDELINS,0230,71870,71235,Hurigny,71,,,71235000AP0154,,,,,,,,,,,,,0,1,Maison,87,4,S,sols,,,686,4.792466,46.343902
2021-1181266,2021-02-25,000001,Vente,168700,294,,RUE DES LOMBARDS,0360,71870,71235,Hurigny,71,,,71235000AT0201,,,26,,27,,4,,44,,,,4,3,Dépendance,,0,,,,,,4.795744,46.349936
2021-1181266,2021-02-25,000001,Vente,168700,294,,RUE DES LOMBARDS,0360,71870,71235,Hurigny,71,,,71235000AT0201,,,26,,27,,4,,44,,,,4,3,Dépendance,,0,,,,,,4.795744,46.349936
2021-1181266,2021-02-25,000001,Vente,168700,294,,RUE DES LOMBARDS,0360,71870,71235,Hurigny,71,,,71235000AT0201,,,26,,27,,4,,44,,,,4,3,Dépendance,,0,,,,,,4.795744,46.349936
2021-1181266,2021-02-25,000001,Vente,168700,294,,RUE DES LOMBARDS,0360,71870,71235,Hurigny,71,,,71235000AT0201,,,26,,27,,4,,44,,,,4,2,Appartement,80,3,,,,,,4.795744,46.349936
2021-1181510,2021-03-04,000001,Vente,427770,2,,RUE DES MIOLANDS,0395,71870,71235,Hurigny,71,,,71235000AP0057,,,,,,,,,,,,,0,1,Maison,150,4,S,sols,,,343,4.791902,46.342656
2021-1181527,2021-03-26,000001,Vente,285640,5,,RUE EMILE VIOLET,0165,71870,71235,Hurigny,71,,,71235000AM0139,,,,,,,,,,,,,0,1,Maison,100,4,S,sols,,,1016,4.797573,46.331166
2021-1181527,2021-03-26,000001,Vente,285640,,,CHAZOUX,B016,71870,71235,Hurigny,71,,,71235000AM0143,,,,,,,,,,,,,0,,,,,AG,terrains d'agrément,,,470,4.797525,46.331021
2021-1181631,2021-03-11,000001,Vente,107000,867,,RUE DES PIASSES,0475,71870,71235,Hurigny,71,,,71235000BC0046,,,,,,,,,,,,,0,,,,,J,jardins,,,1181,4.799657,46.343704
2021-1181735,2021-03-31,000001,Vente,250000,148,,RUE DES GANDELINS,0235,71870,71235,Hurigny,71,,,71235000AP0007,,,,,,,,,,,,,0,1,Maison,95,4,S,sols,,,1362,4.793281,46.344169
2021-1181735,2021-03-31,000001,Vente,250000,148,,RUE DES GANDELINS,0235,71870,71235,Hurigny,71,,,71235000AP0007,,,,,,,,,,,,,0,3,Dépendance,,0,S,sols,,,1362,4.793281,46.344169
2021-1181759,2021-04-28,000001,Vente,232000,478,,RUE DU CLOS DU CHATEAU,0082,71870,71235,Hurigny,71,,,71235000AV0216,,,,,,,,,,,,,0,1,Maison,100,4,S,sols,,,1014,4.793946,46.358403
2021-1181759,2021-04-28,000001,Vente,232000,478,,RUE DU CLOS DU CHATEAU,0082,71870,71235,Hurigny,71,,,71235000AV0216,,,,,,,,,,,,,0,3,Dépendance,,0,S,sols,,,1014,4.793946,46.358403
2021-1181803,2021-05-03,000001,Vente,222500,116,,RUE DES LOMBARDS,0360,71870,71235,Hurigny,71,,,71235000AT0144,,,,,,,,,,,,,0,1,Maison,79,3,S,sols,,,644,4.794444,46.351354
2021-1181852,2021-05-04,000001,Vente,70000,,,RUE DES MIOLANDS,0395,71870,71235,Hurigny,71,,,71235000AP0192,,,,,,,,,,,,,0,,,,,AG,terrains d'agrément,,,122,4.790152,46.344543
2021-1181852,2021-05-04,000001,Vente,70000,,,RUE DES MIOLANDS,0395,71870,71235,Hurigny,71,,,71235000AP0193,,,,,,,,,,,,,0,,,,,AB,terrains a bâtir,,,453,4.790308,46.344431
2021-1181852,2021-05-04,000001,Vente,70000,,,RUE DES MIOLANDS,0395,71870,71235,Hurigny,71,,,71235000AP0196,,,,,,,,,,,,,0,,,,,AB,terrains a bâtir,,,549,4.790422,46.344295
2021-1181866,2021-05-06,000001,Vente,5992,,,AUX VIGNOUX,B103,71870,71235,Hurigny,71,,,71235000AP0100,,,,,,,,,,,,,0,,,,,T,terres,,,2996,4.786151,46.34207
2021-1181868,2021-05-07,000002,Vente,12306,,,AUX VIGNOUX,B103,71870,71235,Hurigny,71,,,71235000AP0103,,,,,,,,,,,,,0,,,,,T,terres,,,4753,4.785245,46.342275
2021-1181883,2021-05-07,000001,Vente,95000,136,,RUE DES ROUSSEAUX,0595,71870,71235,Hurigny,71,,,71235000AR0307,,,,,,,,,,,,,0,,,,,AG,terrains d'agrément,,,1081,4.793336,46.346167
2021-1181918,2021-04-28,000001,Vente,100000,,,EN SAVATTE,B085,71870,71235,Hurigny,71,,,71235000AW0252,,,,,,,,,,,,,0,,,,,T,terres,,,1801,4.789186,46.359356
2021-1182050,2021-05-07,000001,Vente,245250,117,,ALL DES MIOLANDS,0389,71870,71235,Hurigny,71,,,71235000AP0129,,,,,,,,,,,,,0,1,Maison,106,5,AG,terrains d'agrément,,,633,4.793427,46.343181
2021-1182050,2021-05-07,000001,Vente,245250,117,,ALL DES MIOLANDS,0389,71870,71235,Hurigny,71,,,71235000AP0129,,,,,,,,,,,,,0,1,Maison,106,5,S,sols,,,500,4.793427,46.343181
2021-1182078,2021-05-12,000001,Vente,130000,64,,RUE DES MIOLANDS,0395,71870,71235,Hurigny,71,,,71235000AP0054,,,,,,,,,,,,,0,1,Maison,57,2,S,sols,,,378,4.791188,46.34261
2021-1182195,2021-06-14,000001,Vente,217284,134,,ALL DES SOUCHONS,0640,71870,71235,Hurigny,71,,,71235000AT0056,,,,,,,,,,,,,0,1,Maison,88,5,S,sols,,,698,4.793207,46.351977
2021-1182218,2021-06-11,000001,Vente,160000,9000,,LA VERCHERE,B099,71870,71235,Hurigny,71,,,71235000AC0159,,,,,,,,,,,,,0,4,Local industriel. commercial ou assimilé,145,0,AG,terrains d'agrément,,,1224,4.805175,46.326677
2021-1182218,2021-06-11,000001,Vente,160000,9000,,LA VERCHERE,B099,71870,71235,Hurigny,71,,,71235000AC0159,,,,,,,,,,,,,0,4,Local industriel. commercial ou assimilé,145,0,S,sols,,,973,4.805175,46.326677
2021-1182221,2021-05-21,000002,Vente,82884,,,AUX VIGNOUX,B103,71870,71235,Hurigny,71,,,71235000AP0091,,,,,,,,,,,,,0,,,,,P,prés,,,473,4.790116,46.342538
2021-1182221,2021-05-21,000002,Vente,82884,,,AUX VIGNOUX,B103,71870,71235,Hurigny,71,,,71235000AP0092,,,,,,,,,,,,,0,,,,,VE,vergers,,,700,4.789659,46.342482
2021-1182221,2021-05-21,000002,Vente,82884,,,AUX VIGNOUX,B103,71870,71235,Hurigny,71,,,71235000AP0092,,,,,,,,,,,,,0,,,,,T,terres,,,891,4.789659,46.342482
2021-1182221,2021-05-21,000002,Vente,82884,,,AUX VIGNOUX,B103,71870,71235,Hurigny,71,,,71235000AP0208,,,,,,,,,,,,,0,,,,,T,terres,,,21562,4.788269,46.342059
2021-1182221,2021-05-21,000002,Vente,82884,,,AUX VIGNOUX,B103,71870,71235,Hurigny,71,,,71235000AP0208,,,,,,,,,,,,,0,,,,,T,terres,,,19392,4.788269,46.342059
2021-1182267,2021-05-21,000001,Vente,75000,,,EN MARS,B059,71870,71235,Hurigny,71,,,71235000AR0285,,,,,,,,,,,,,0,,,,,AB,terrains a bâtir,,,151,4.790654,46.349461
2021-1182267,2021-05-21,000001,Vente,75000,,,EN MARS,B059,71870,71235,Hurigny,71,,,71235000AT0264,,,,,,,,,,,,,0,,,,,AB,terrains a bâtir,,,606,4.790749,46.349602
2021-1182301,2021-05-26,000001,Vente,341700,52,,RUE DES PIOTS,0515,71870,71235,Hurigny,71,,,71235000AN0022,,,,,,,,,,,,,0,3,Dépendance,,0,S,sols,,,689,4.792572,46.338076
2021-1182301,2021-05-26,000001,Vente,341700,52,,RUE DES PIOTS,0515,71870,71235,Hurigny,71,,,71235000AN0022,,,,,,,,,,,,,0,1,Maison,148,5,S,sols,,,689,4.792572,46.338076
2021-1182345,2021-06-19,000001,Vente,307000,709,,RTE DE MACON,0370,71870,71235,Hurigny,71,,,71235000AD0065,,,,,,,,,,,,,0,1,Maison,110,4,T,terres,,,1413,4.799608,46.329657
2021-1182345,2021-06-19,000001,Vente,307000,709,,RTE DE MACON,0370,71870,71235,Hurigny,71,,,71235000AD0065,,,,,,,,,,,,,0,1,Maison,110,4,S,sols,,,1017,4.799608,46.329657
2021-1182539,2021-06-18,000001,Vente,72000,,,EN MARS,B059,71870,71235,Hurigny,71,,,71235000AR0287,,,,,,,,,,,,,0,,,,,AB,terrains a bâtir,,,178,4.791218,46.349402
2021-1182539,2021-06-18,000001,Vente,72000,,,EN MARS,B059,71870,71235,Hurigny,71,,,71235000AT0262,,,,,,,,,,,,,0,,,,,AB,terrains a bâtir,,,580,4.79127,46.349577
2021-1182606,2021-07-01,000001,Vente,68000,,,RTE DE MACON,0370,71870,71235,Hurigny,71,,,71235000AR0248,,,,,,,,,,,,,0,,,,,AB,terrains a bâtir,,,166,4.791918,46.348942
2021-1182606,2021-07-01,000001,Vente,68000,,,EN MARS,B059,71870,71235,Hurigny,71,,,71235000AR0273,,,,,,,,,,,,,0,,,,,AB,terrains a bâtir,,,574,4.791981,46.349121
2021-1182790,2021-07-09,000002,Vente,1162,,,LES TAUCHES,B089,71870,71235,Hurigny,71,,,71235000AW0202,,,,,,,,,,,,,0,,,,,P,prés,,,908,4.78666,46.355962
2021-1182790,2021-07-09,000002,Vente,1162,,,LES TAUCHES,B089,71870,71235,Hurigny,71,,,71235000AW0254,,,,,,,,,,,,,0,,,,,T,terres,,,254,4.786753,46.355988
2021-1182865,2021-07-13,000001,Vente,3800,,,EN SAVATTE,B085,71870,71235,Hurigny,71,,,71235000AW0156,,,,,,,,,,,,,0,,,,,T,terres,,,3763,4.794011,46.360877
2021-1182865,2021-07-13,000001,Vente,3800,,,EN SAVATTE,B085,71870,71235,Hurigny,71,,,71235000AW0162,,,,,,,,,,,,,0,,,,,T,terres,,,8013,4.792989,46.360957
2021-1182884,2021-07-19,000001,Vente,210000,16,,RUE DES PIOTS,0515,71870,71235,Hurigny,71,,,71235000AN0024,,,,,,,,,,,,,0,1,Maison,115,4,S,sols,,,225,4.792496,46.338401
2021-1182884,2021-07-19,000001,Vente,210000,,,RUE DES PIOTS,0515,71870,71235,Hurigny,71,,,71235000AN0025,,,,,,,,,,,,,0,,,,,S,sols,,,216,4.792468,46.338484
2021-1183256,2021-08-17,000001,Vente,235800,63,,IMP DES FLAMUSSONS,0182,71870,71235,Hurigny,71,,,71235000AR0158,,,,,,,,,,,,,0,4,Local industriel. commercial ou assimilé,97,0,S,sols,,,832,4.790581,46.346338
2021-1183256,2021-08-17,000001,Vente,235800,,,LOT DES ROUSSEAUX,A007,71870,71235,Hurigny,71,,,71235000AR0161,,,,,,,,,,,,,0,,,,,S,sols,,,875,4.790803,46.346243
2021-1183256,2021-08-17,000001,Vente,235800,,,LOT DES ROUSSEAUX,A007,71870,71235,Hurigny,71,,,71235000AR0162,,,,,,,,,,,,,0,,,,,S,sols,,,15,4.791361,46.345772
2021-1183256,2021-08-17,000001,Vente,235800,,,LOT DES ROUSSEAUX,A007,71870,71235,Hurigny,71,,,71235000AR0163,,,,,,,,,,,,,0,,,,,S,sols,,,256,4.790915,46.345756
2021-1183256,2021-08-17,000001,Vente,235800,,,LOT DES ROUSSEAUX,A007,71870,71235,Hurigny,71,,,71235000AR0164,,,,,,,,,,,,,0,,,,,S,sols,,,177,4.791441,46.346094
2021-1183256,2021-08-17,000001,Vente,235800,,,CHE DES FLAMUSSONS,0180,71870,71235,Hurigny,71,,,71235000AR0165,,,,,,,,,,,,,0,,,,,S,sols,,,117,4.789868,46.34657
2021-1183327,2021-09-27,000001,Vente,300,,,AUX VIGNOUX,B103,71870,71235,Hurigny,71,,,71235000AP0099,,,,,,,,,,,,,0,,,,,T,terres,,,874,4.787439,46.341473
2021-1183370,2021-09-15,000001,Vente,75000,,,RUE DES MIOLANDS,0395,71870,71235,Hurigny,71,,,71235000AP0174,,,,,,,,,,,,,0,,,,,AG,terrains d'agrément,,,81,4.790866,46.344749
2021-1183370,2021-09-15,000001,Vente,75000,,,RUE DES MIOLANDS,0395,71870,71235,Hurigny,71,,,71235000AP0175,,,,,,,,,,,,,0,,,,,AB,terrains a bâtir,,,819,4.791129,46.34459
2021-1183370,2021-09-15,000001,Vente,75000,,,RUE DES MIOLANDS,0395,71870,71235,Hurigny,71,,,71235000AP0184,,,,,,,,,,,,,0,,,,,AB,terrains a bâtir,,,321,4.791201,46.344779
2021-1183386,2021-09-14,000001,Vente,68000,,,RTE DE MACON,0370,71870,71235,Hurigny,71,,,71235000AR0254,,,,,,,,,,,,,0,,,,,AB,terrains a bâtir,,,750,4.791059,46.348818
2021-1183485,2021-10-08,000001,Vente,120000,49,,RUE EMILE VIOLET,0165,71870,71235,Hurigny,71,,,71235000AM0061,,,,,,,,,,,,,0,1,Maison,50,2,S,sols,,,835,4.797042,46.331148
2021-1183642,2021-10-25,000001,Vente,256000,160,,RUE DU CLOS DU CHATEAU,0082,71870,71235,Hurigny,71,,,71235000AV0164,,,,,,,,,,,,,0,1,Maison,83,4,S,sols,,,960,4.794777,46.356257
2021-1183689,2021-10-08,000001,Vente,72000,,,EN MARS,B059,71870,71235,Hurigny,71,,,71235000AR0289,,,,,,,,,,,,,0,,,,,AB,terrains a bâtir,,,191,4.791872,46.34932
2021-1183689,2021-10-08,000001,Vente,72000,,,EN MARS,B059,71870,71235,Hurigny,71,,,71235000AT0260,,,,,,,,,,,,,0,,,,,AB,terrains a bâtir,,,566,4.79198,46.349456
2021-1183704,2021-10-22,000001,Vente,67000,2933,,RTE DE MACON,0370,71870,71235,Hurigny,71,,,71235000AR0222,,,,,,,,,,,,,0,,,,,AB,terrains a bâtir,,,449,4.791414,46.348525
2021-1183704,2021-10-22,000001,Vente,67000,,,RTE DE MACON,0370,71870,71235,Hurigny,71,,,71235000AR0252,,,,,,,,,,,,,0,,,,,AB,terrains a bâtir,,,270,4.79149,46.348633
2021-1183733,2021-11-03,000001,Vente,8000,,,CLOS DE LA BRESSANDE,B019,71870,71235,Hurigny,71,,,71235000AW0199,,,,,,,,,,,,,0,,,,,T,terres,,,2686,4.787161,46.350903
2021-1183746,2021-11-08,000001,Vente,209600,,,CHATEAU D HURIGNY,B014,71870,71235,Hurigny,71,,,71235000AT0276,,,,,,,,,,,,,0,,,,,P,prés,,,558,4.794428,46.353779
2021-1183746,2021-11-08,000001,Vente,209600,,,CHATEAU D HURIGNY,B014,71870,71235,Hurigny,71,,,71235000AT0277,,,,,,,,,,,,,0,,,,,P,prés,,,5240,4.794305,46.35354
2021-1183759,2021-10-08,000001,Vente,200000,127,,RUE DU MONT ROUGE,0425,71870,71235,Hurigny,71,,,71235000AL0048,,,,,,,,,,,,,0,1,Maison,138,8,J,jardins,,,1088,4.784403,46.335365
2021-1183759,2021-10-08,000001,Vente,200000,127,,RUE DU MONT ROUGE,0425,71870,71235,Hurigny,71,,,71235000AL0048,,,,,,,,,,,,,0,1,Maison,138,8,S,sols,,,700,4.784403,46.335365
2021-1183840,2021-10-27,000001,Vente,180000,74,,IMP DES VERCHERES,0785,71870,71235,Hurigny,71,,,71235000AV0070,,,,,,,,,,,,,0,1,Maison,77,4,S,sols,,,1160,4.798582,46.353487
2021-1183904,2021-10-28,000001,Vente,228000,14,,ALL DES GANDELINS,0230,71870,71235,Hurigny,71,,,71235000AP0155,,,,,,,,,,,,,0,1,Maison,90,4,S,sols,,,699,4.792544,46.344202
2021-1184014,2021-11-29,000001,Vente,68000,,,RTE DE MACON,0370,71870,71235,Hurigny,71,,,71235000AR0249,,,,,,,,,,,,,0,,,,,AB,terrains a bâtir,,,573,4.791485,46.348941
2021-1184014,2021-11-29,000001,Vente,68000,,,EN MARS,B059,71870,71235,Hurigny,71,,,71235000AR0274,,,,,,,,,,,,,0,,,,,AB,terrains a bâtir,,,167,4.791552,46.349039
2021-1184064,2021-12-07,000001,Vente,82240,,,RUE DE LA CONDEMINE,0110,71870,71235,Hurigny,71,,,71235000AR0309,,,,,,,,,,,,,0,,,,,AG,terrains d'agrément,,,687,4.797246,46.344503
2021-1184184,2021-12-17,000001,Vente,75000,,,RTE DE MACON,0370,71870,71235,Hurigny,71,,,71235000AR0261,,,,,,,,,,,,,0,,,,,AB,terrains a bâtir,,,792,4.790238,46.348809
2021-1184231,2021-12-17,000001,Vente,130000,,,LES SABLONNES,B081,71870,71235,Hurigny,71,,,71235000AE0052,,,,,,,,,,,,,0,,,,,T,terres,,,1375,4.796818,46.330463
2021-1184305,2021-12-15,000001,Vente,315000,1,,IMP DES GUERRETS,0290,71870,71235,Hurigny,71,,,71235000AD0064,,,,,,,,,,,,,0,3,Dépendance,,0,S,sols,,,1272,4.79938,46.32977
2021-1184305,2021-12-15,000001,Vente,315000,1,,IMP DES GUERRETS,0290,71870,71235,Hurigny,71,,,71235000AD0064,,,,,,,,,,,,,0,1,Maison,117,4,S,sols,,,1272,4.79938,46.32977
2021-1184305,2021-12-15,000001,Vente,315000,1,,IMP DES GUERRETS,0290,71870,71235,Hurigny,71,,,71235000AD0064,,,,,,,,,,,,,0,3,Dépendance,,0,T,terres,,,608,4.79938,46.32977
2021-1184305,2021-12-15,000001,Vente,315000,1,,IMP DES GUERRETS,0290,71870,71235,Hurigny,71,,,71235000AD0064,,,,,,,,,,,,,0,1,Maison,117,4,T,terres,,,608,4.79938,46.32977
2021-1184359,2021-12-17,000001,Vente,25000,,,LE CLOS DE LA MAISON,B021,71870,71235,Hurigny,71,,,71235000AR0048,,,,,,,,,,,,,0,,,,,VI,vignes,VAOC,Vins d'appellation d'origine contrôlée,1160,4.798975,46.347391
2021-1184359,2021-12-17,000001,Vente,25000,,,LE CLOS DE LA MAISON,B021,71870,71235,Hurigny,71,,,71235000AR0048,,,,,,,,,,,,,0,,,,,P,prés,,,3228,4.798975,46.347391
2021-1184360,2021-12-15,000001,Vente,68000,,,RTE DE MACON,0370,71870,71235,Hurigny,71,,,71235000AR0247,,,,,,,,,,,,,0,,,,,AB,terrains a bâtir,,,711,4.791891,46.348795
2021-1184360,2021-12-15,000001,Vente,68000,,,RTE DE MACON,0370,71870,71235,Hurigny,71,,,71235000AR0250,,,,,,,,,,,,,0,,,,,S,sols,,,275,4.791294,46.348969
2021-1184360,2021-12-15,000001,Vente,68000,,,EN MARS,B059,71870,71235,Hurigny,71,,,71235000AR0282,,,,,,,,,,,,,0,,,,,S,sols,,,2005,4.791628,46.349176
2021-1184361,2021-12-21,000001,Vente,68000,,,RTE DE MACON,0370,71870,71235,Hurigny,71,,,71235000AR0256,,,,,,,,,,,,,0,,,,,AB,terrains a bâtir,,,423,4.790688,46.348961
2021-1184361,2021-12-21,000001,Vente,68000,,,EN MARS,B059,71870,71235,Hurigny,71,,,71235000AR0279,,,,,,,,,,,,,0,,,,,AB,terrains a bâtir,,,277,4.790748,46.349071
2021-1184398,2021-02-25,000001,Vente,60000,2933,,RTE DE MACON,0370,71870,71235,Hurigny,71,,,71235000AR0226,,,,,,,,,,,,,0,,,,,S,sols,,,1,4.790763,46.348656
2021-1184398,2021-02-25,000001,Vente,60000,,,RTE DE MACON,0370,71870,71235,Hurigny,71,,,71235000AR0257,,,,,,,,,,,,,0,,,,,AB,terrains a bâtir,,,699,4.790682,46.348718
