id_mutation,date_mutation,numero_disposition,nature_mutation,valeur_fonciere,adresse_numero,adresse_suffixe,adresse_nom_voie,adresse_code_voie,code_postal,code_commune,nom_commune,code_departement,ancien_code_commune,ancien_nom_commune,id_parcelle,ancien_id_parcelle,numero_volume,lot1_numero,lot1_surface_carrez,lot2_numero,lot2_surface_carrez,lot3_numero,lot3_surface_carrez,lot4_numero,lot4_surface_carrez,lot5_numero,lot5_surface_carrez,nombre_lots,code_type_local,type_local,surface_reelle_bati,nombre_pieces_principales,code_nature_culture,nature_culture,code_nature_culture_speciale,nature_culture_speciale,surface_terrain,longitude,latitude
2021-1195096,2021-03-30,000001,Vente,132000,,,AUX CHAMPS GEORGES,B154,71290,71261,Loisy,71,,,712610000F0226,,,,,,,,,,,,,0,,,,,T,terres,,,340,4.978542,46.587071
2021-1195096,2021-03-30,000001,Vente,132000,,,AUX CHAMPS GEORGES,B154,71290,71261,Loisy,71,,,712610000F0227,,,,,,,,,,,,,0,,,,,T,terres,,,1320,4.978431,46.587024
2021-1195096,2021-03-30,000001,Vente,132000,,,AUX CHAMPS GEORGES,B154,71290,71261,Loisy,71,,,712610000F0228,,,,,,,,,,,,,0,,,,,T,terres,,,155,4.978165,46.586972
2021-1195096,2021-03-30,000001,Vente,132000,641,,RTE DE TOURNUS,0225,71290,71261,Loisy,71,,,712610000F0230,,,,,,,,,,,,,0,3,Dépendance,,0,S,sols,,,1067,4.97833,46.586414
2021-1195096,2021-03-30,000001,Vente,132000,641,,RTE DE TOURNUS,0225,71290,71261,Loisy,71,,,712610000F0230,,,,,,,,,,,,,0,1,Maison,140,4,S,sols,,,1067,4.97833,46.586414
2021-1195107,2021-03-26,000002,Vente,543,,,AU PRE DES ETANGS,B362,71290,71261,Loisy,71,,,712610000F0610,,,,,,,,,,,,,0,,,,,BP,peupleraies,,,2743,4.981517,46.57644
2021-1195107,2021-03-26,000002,Vente,543,,,AU PRE DES ETANGS,B362,71290,71261,Loisy,71,,,712610000F0612,,,,,,,,,,,,,0,,,,,BP,peupleraies,,,2162,4.981554,46.577011
2021-1195180,2021-05-03,000001,Vente,35000,32,,IMP DES CHARRIERES,0080,71290,71261,Loisy,71,,,712610000A1124,,,,,,,,,,,,,0,1,Maison,44,1,S,sols,,,1230,5.026045,46.601008
2021-1195181,2021-05-03,000002,Vente,180000,130,,CHEM DES CHAMPS PARADIS,0070,71290,71261,Loisy,71,,,712610000A0037,,,,,,,,,,,,,0,3,Dépendance,,0,S,sols,,,2180,5.026018,46.601445
2021-1195181,2021-05-03,000002,Vente,180000,130,,CHEM DES CHAMPS PARADIS,0070,71290,71261,Loisy,71,,,712610000A0037,,,,,,,,,,,,,0,1,Maison,95,4,S,sols,,,2180,5.026018,46.601445
2021-1195181,2021-05-03,000002,Vente,180000,130,,CHEM DES CHAMPS PARADIS,0070,71290,71261,Loisy,71,,,712610000A0037,,,,,,,,,,,,,0,3,Dépendance,,0,S,sols,,,2180,5.026018,46.601445
2021-1195181,2021-05-03,000002,Vente,180000,,,VOTANTENAY,B440,71290,71261,Loisy,71,,,712610000A1178,,,,,,,,,,,,,0,,,,,S,sols,,,516,5.026325,46.601581
2021-1195182,2021-05-03,000003,Vente,20000,,,CURTIL DUFOUR,B195,71290,71261,Loisy,71,,,712610000A0035,,,,,,,,,,,,,0,,,,,P,prés,,,1675,5.025567,46.600908
2021-1195182,2021-05-03,000003,Vente,20000,,,CURTIL DUFOUR,B195,71290,71261,Loisy,71,,,712610000A0036,,,,,,,,,,,,,0,,,,,T,terres,,,624,5.025741,46.600989
2021-1195182,2021-05-03,000003,Vente,20000,,,CURTIL DUFOUR,B195,71290,71261,Loisy,71,,,712610000A1356,,,,,,,,,,,,,0,,,,,P,prés,,,4742,5.02532,46.601316
2021-1195204,2021-04-22,000001,Vente,3925.15,,,CURTIL MONTAGNAUT,B199,71290,71261,Loisy,71,,,712610000A0101,,,,,,,,,,,,,0,,,,,VI,vignes,,,840,5.029143,46.600079
2021-1195204,2021-04-22,000001,Vente,3925.15,,,VOTANTENAY,B440,71290,71261,Loisy,71,,,712610000A1142,,,,,,,,,,,,,0,,,,,P,prés,,,2491,5.027576,46.60113
2021-1195224,2021-04-22,000001,Vente,623,,,LA MARE AU LOUP,B282,71290,71261,Loisy,71,,,712610000B0035,,,,,,,,,,,,,0,,,,,T,terres,,,1570,5.025376,46.597076
2021-1195224,2021-04-22,000001,Vente,623,,,LES GRANDES VERNES,B252,71290,71261,Loisy,71,,,712610000B0167,,,,,,,,,,,,,0,,,,,T,terres,,,2110,5.012078,46.592166
2021-1195224,2021-04-22,000001,Vente,623,,,AU GRAND CHAMP,B236,71290,71261,Loisy,71,,,712610000E0104,,,,,,,,,,,,,0,,,,,P,prés,,,1520,4.994412,46.582922
2021-1195289,2021-05-05,000001,Vente,107000,,,CHAMP DE LA CROIX,B103,71290,71261,Loisy,71,,,712610000D0401,,,,,,,,,,,,,0,,,,,BT,taillis simples,ACACI,Acacias,121,5.012257,46.586673
2021-1195289,2021-05-05,000001,Vente,107000,449,,RUE DE PLAINCHAMP,0196,71290,71261,Loisy,71,,,712610000D0405,,,,,,,,,,,,,0,1,Maison,80,3,S,sols,,,1529,5.012088,46.58634
2021-1195636,2021-06-21,000001,Vente,67400,,,CHAMP DU PAIN,B125,71290,71261,Loisy,71,,,712610000C0117,,,,,,,,,,,,,0,,,,,J,jardins,,,980,5.027833,46.583386
2021-1195636,2021-06-21,000001,Vente,67400,119,,PL DES HALLES,0140,71290,71261,Loisy,71,,,712610000C0121,,,,,,,,,,,,,0,4,Local industriel. commercial ou assimilé,128,0,S,sols,,,968,5.028308,46.582952
2021-1195636,2021-06-21,000001,Vente,67400,119,,PL DES HALLES,0140,71290,71261,Loisy,71,,,712610000C0121,,,,,,,,,,,,,0,4,Local industriel. commercial ou assimilé,95,0,S,sols,,,968,5.028308,46.582952
2021-1195636,2021-06-21,000001,Vente,67400,119,,PL DES HALLES,0140,71290,71261,Loisy,71,,,712610000C0121,,,,,,,,,,,,,0,1,Maison,120,4,S,sols,,,968,5.028308,46.582952
2021-1195637,2021-06-25,000001,Vente,195000,,,A BRUGERETTE,B075,71290,71261,Loisy,71,,,712610000A0162,,,,,,,,,,,,,0,,,,,P,prés,,,1635,5.025898,46.597979
2021-1195637,2021-06-25,000001,Vente,195000,,,VOTANTENAY,B440,71290,71261,Loisy,71,,,712610000A1173,,,,,,,,,,,,,0,,,,,PA,pâtures,PATUR,Pâture plantée,54,5.025928,46.598599
2021-1195637,2021-06-25,000001,Vente,195000,,,VOTANTENAY,B440,71290,71261,Loisy,71,,,712610000A1174,,,,,,,,,,,,,0,,,,,PA,pâtures,PATUR,Pâture plantée,895,5.025915,46.598207
2021-1195637,2021-06-25,000001,Vente,195000,,,LES PETITES COMBES,B314,71290,71261,Loisy,71,,,712610000A1260,,,,,,,,,,,,,0,,,,,S,sols,,,12,5.026228,46.598482
2021-1195637,2021-06-25,000001,Vente,195000,30,,RUE BOUCLE DU PAQUIER,0192,71290,71261,Loisy,71,,,712610000A1262,,,,,,,,,,,,,0,1,Maison,155,7,S,sols,,,2964,5.026149,46.598382
2021-1195637,2021-06-25,000001,Vente,195000,30,,RUE BOUCLE DU PAQUIER,0192,71290,71261,Loisy,71,,,712610000A1262,,,,,,,,,,,,,0,1,Maison,84,4,S,sols,,,2964,5.026149,46.598382
2021-1195725,2021-06-24,000001,Vente,2861,,,CHAMP DU BOIS,B123,71290,71261,Loisy,71,,,712610000F0002,,,,,,,,,,,,,0,,,,,T,terres,,,4330,4.979869,46.57691
2021-1195725,2021-06-24,000001,Vente,2861,,,AU CHAMP RAGUILLIER,B148,71290,71261,Loisy,71,,,712610000F0056,,,,,,,,,,,,,0,,,,,T,terres,,,1850,4.980351,46.582171
2021-1195725,2021-06-24,000001,Vente,2861,,,AU CHAMP DE LA VALLEE,B112,71290,71261,Loisy,71,,,712610000F0262,,,,,,,,,,,,,0,,,,,T,terres,,,3450,4.981028,46.587237
2021-1195725,2021-06-24,000001,Vente,2861,,,L ETANG GALOPIN,B215,71290,71261,Loisy,71,,,712610000F0389,,,,,,,,,,,,,0,,,,,P,prés,,,1215,4.983043,46.591801
2021-1195726,2021-07-07,000001,Vente,2207.4,,,BOIS DU CLOU,B050,71290,71261,Loisy,71,,,712610000E0355,,,,,,,,,,,,,0,,,,,T,terres,,,12240,4.992376,46.5773
2021-1195726,2021-07-07,000001,Vente,2207.4,,,BOIS DU CLOU,B050,71290,71261,Loisy,71,,,712610000E0356,,,,,,,,,,,,,0,,,,,T,terres,,,4595,4.990281,46.577547
2021-1195839,2021-07-08,000001,Vente,1200,,,LA CHAGNEE,B084,71290,71261,Loisy,71,,,712610000B0014,,,,,,,,,,,,,0,,,,,BS,taillis sous futaie,,,2430,5.02312,46.597839
2021-1195839,2021-07-08,000001,Vente,1200,,,LA MARE AU LOUP,B282,71290,71261,Loisy,71,,,712610000B0042,,,,,,,,,,,,,0,,,,,BS,taillis sous futaie,,,2850,5.024218,46.596086
2021-1195839,2021-07-08,000001,Vente,1200,,,LE CHATELET,B163,71290,71261,Loisy,71,,,712610000B0049,,,,,,,,,,,,,0,,,,,BS,taillis sous futaie,,,4790,5.022903,46.595819
2021-1195908,2021-07-30,000001,Vente,2241.62,,,CHAMP COURBE D EN BAS,B095,71290,71261,Loisy,71,,,712610000A0995,,,,,,,,,,,,,0,,,,,BT,taillis simples,,,505,4.986808,46.590522
2021-1196013,2021-08-12,000001,Vente,115000,,,PLAINCHAMP,B326,71290,71261,Loisy,71,,,712610000D0535,,,,,,,,,,,,,0,,,,,P,prés,,,1300,5.014162,46.58263
2021-1196013,2021-08-12,000001,Vente,115000,134,,MTE DE PLAINCHAMP,0195,71290,71261,Loisy,71,,,712610000D0536,,,,,,,,,,,,,0,1,Maison,110,5,S,sols,,,1064,5.013736,46.582763
2021-1196073,2021-09-03,000001,Vente,289550,25,,RUE DU VERNAY,0235,71290,71261,Loisy,71,,,712610000E0147,,,,,,,,,,,,,0,1,Maison,171,6,S,sols,,,990,4.998265,46.582766
2021-1196073,2021-09-03,000001,Vente,289550,25,,RUE DU VERNAY,0235,71290,71261,Loisy,71,,,712610000E0147,,,,,,,,,,,,,0,4,Local industriel. commercial ou assimilé,52,0,S,sols,,,990,4.998265,46.582766
2021-1196073,2021-09-03,000001,Vente,289550,25,,RUE DU VERNAY,0235,71290,71261,Loisy,71,,,712610000E0147,,,,,,,,,,,,,0,3,Dépendance,,0,S,sols,,,990,4.998265,46.582766
2021-1196073,2021-09-03,000001,Vente,289550,25,,RUE DU VERNAY,0235,71290,71261,Loisy,71,,,712610000E0147,,,,,,,,,,,,,0,3,Dépendance,,0,S,sols,,,990,4.998265,46.582766
2021-1196073,2021-09-03,000001,Vente,289550,,,AU JUB,B263,71290,71261,Loisy,71,,,712610000E0148,,,,,,,,,,,,,0,,,,,AG,terrains d'agrément,,,1395,4.998398,46.582549
2021-1196073,2021-09-03,000001,Vente,289550,,,AU JUB,B263,71290,71261,Loisy,71,,,712610000E0871,,,,,,,,,,,,,0,,,,,AG,terrains d'agrément,,,945,4.998108,46.582562
2021-1196107,2021-09-03,000001,Vente,1700,,,LES BRUYERES DE LAFAY,B076,71290,71261,Loisy,71,,,712610000A0641,,,,,,,,,,,,,0,,,,,BT,taillis simples,,,3360,5.011577,46.599631
2021-1196108,2021-09-01,000001,Vente,123000,141,,RUE DE LA MAS DU JUB,0160,71290,71261,Loisy,71,,,712610000E0642,,,,,,,,,,,,,0,1,Maison,103,3,S,sols,,,1665,4.99806,46.584581
2021-1196108,2021-09-01,000001,Vente,123000,,,AUX GRANDES BRUYERES,B248,71290,71261,Loisy,71,,,712610000E0643,,,,,,,,,,,,,0,,,,,T,terres,,,3862,4.997189,46.584802
2021-1196109,2021-09-03,000001,Vente,800,,,LES CHAMPS JANIN,B156,71290,71261,Loisy,71,,,712610000A0640,,,,,,,,,,,,,0,,,,,T,terres,,,3534,5.01119,46.599622
2021-1196153,2021-09-10,000001,Vente,123000,,,CURTIL DUFOUR,B195,71290,71261,Loisy,71,,,712610000A0055,,,,,,,,,,,,,0,,,,,P,prés,,,1340,5.025931,46.599884
2021-1196153,2021-09-10,000001,Vente,123000,278,,RUE BOUCLE DU PAQUIER,0192,71290,71261,Loisy,71,,,712610000A1244,,,,,,,,,,,,,0,1,Maison,120,4,S,sols,,,771,5.025718,46.599411
2021-1196153,2021-09-10,000001,Vente,123000,278,,RUE BOUCLE DU PAQUIER,0192,71290,71261,Loisy,71,,,712610000A1244,,,,,,,,,,,,,0,3,Dépendance,,0,S,sols,,,771,5.025718,46.599411
2021-1196153,2021-09-10,000001,Vente,123000,,,CURTIL DUFOUR,B195,71290,71261,Loisy,71,,,712610000A1246,,,,,,,,,,,,,0,,,,,S,sols,,,753,5.025812,46.599586
2021-1196298,2021-10-18,000001,Vente,298000,,,PLAINCHAMP,B326,71290,71261,Loisy,71,,,712610000D0433,,,,,,,,,,,,,0,,,,,J,jardins,,,583,5.013387,46.58333
2021-1196298,2021-10-18,000001,Vente,298000,,,PLAINCHAMP,B326,71290,71261,Loisy,71,,,712610000D0434,,,,,,,,,,,,,0,,,,,T,terres,,,380,5.013477,46.583171
2021-1196298,2021-10-18,000001,Vente,298000,82,,RUE DE PLAINCHAMP,0196,71290,71261,Loisy,71,,,712610000D0435,,,,,,,,,,,,,0,1,Maison,130,4,S,sols,,,762,5.013093,46.583402
2021-1196605,2021-12-03,000001,Echange,150,78,,RUE DU BIEF,0030,71290,71261,Loisy,71,,,712610000D0631,,,,,,,,,,,,,0,,,,,J,jardins,,,143,5.014841,46.57851
2021-1196605,2021-12-03,000001,Echange,150,,,LA CONDEMINE,B179,71290,71261,Loisy,71,,,712610000D0635,,,,,,,,,,,,,0,,,,,VI,vignes,,,11,5.015112,46.57854
2021-1196605,2021-12-03,000002,Echange,150,,,LA CONDEMINE,B179,71290,71261,Loisy,71,,,712610000D0633,,,,,,,,,,,,,0,,,,,P,prés,,,24,5.015375,46.578568
2021-1196673,2021-12-07,000001,Vente,550000,,,LE CURTIL BOURGEON,B192,71290,71261,Loisy,71,,,712610000B0326,,,,,,,,,,,,,0,,,,,T,terres,,,780,5.025543,46.583055
2021-1196673,2021-12-07,000001,Vente,550000,148,,RUE DU PUITS,0205,71290,71261,Loisy,71,,,712610000C0089,,,,,,,,,,,,,0,3,Dépendance,,0,J,jardins,,,1085,5.025191,46.58217
2021-1196673,2021-12-07,000001,Vente,550000,148,,RUE DU PUITS,0205,71290,71261,Loisy,71,,,712610000C0089,,,,,,,,,,,,,0,1,Maison,205,6,P,prés,,,235,5.025191,46.58217
2021-1196673,2021-12-07,000001,Vente,550000,148,,RUE DU PUITS,0205,71290,71261,Loisy,71,,,712610000C0089,,,,,,,,,,,,,0,3,Dépendance,,0,P,prés,,,235,5.025191,46.58217
2021-1196673,2021-12-07,000001,Vente,550000,148,,RUE DU PUITS,0205,71290,71261,Loisy,71,,,712610000C0089,,,,,,,,,,,,,0,3,Dépendance,,0,P,prés,,,235,5.025191,46.58217
2021-1196673,2021-12-07,000001,Vente,550000,148,,RUE DU PUITS,0205,71290,71261,Loisy,71,,,712610000C0089,,,,,,,,,,,,,0,3,Dépendance,,0,P,prés,,,235,5.025191,46.58217
2021-1196673,2021-12-07,000001,Vente,550000,148,,RUE DU PUITS,0205,71290,71261,Loisy,71,,,712610000C0089,,,,,,,,,,,,,0,1,Maison,205,6,J,jardins,,,1085,5.025191,46.58217
2021-1196673,2021-12-07,000001,Vente,550000,148,,RUE DU PUITS,0205,71290,71261,Loisy,71,,,712610000C0089,,,,,,,,,,,,,0,3,Dépendance,,0,J,jardins,,,1085,5.025191,46.58217
2021-1196673,2021-12-07,000001,Vente,550000,148,,RUE DU PUITS,0205,71290,71261,Loisy,71,,,712610000C0089,,,,,,,,,,,,,0,3,Dépendance,,0,J,jardins,,,1085,5.025191,46.58217
2021-1196673,2021-12-07,000001,Vente,550000,148,,RUE DU PUITS,0205,71290,71261,Loisy,71,,,712610000C0089,,,,,,,,,,,,,0,3,Dépendance,,0,S,sols,,,1020,5.025191,46.58217
2021-1196673,2021-12-07,000001,Vente,550000,148,,RUE DU PUITS,0205,71290,71261,Loisy,71,,,712610000C0089,,,,,,,,,,,,,0,3,Dépendance,,0,S,sols,,,1020,5.025191,46.58217
2021-1196673,2021-12-07,000001,Vente,550000,148,,RUE DU PUITS,0205,71290,71261,Loisy,71,,,712610000C0089,,,,,,,,,,,,,0,3,Dépendance,,0,S,sols,,,1020,5.025191,46.58217
2021-1196673,2021-12-07,000001,Vente,550000,148,,RUE DU PUITS,0205,71290,71261,Loisy,71,,,712610000C0089,,,,,,,,,,,,,0,1,Maison,205,6,S,sols,,,1020,5.025191,46.58217
2021-1196673,2021-12-07,000001,Vente,550000,,,LE CURTIL BOURGEON,B192,71290,71261,Loisy,71,,,712610000C0090,,,,,,,,,,,,,0,,,,,J,jardins,,,2485,5.024643,46.582504
2021-1196673,2021-12-07,000001,Vente,550000,,,LE CURTIL BOURGEON,B192,71290,71261,Loisy,71,,,712610000C0090,,,,,,,,,,,,,0,,,,,P,prés,,,4025,5.024643,46.582504
2021-1196673,2021-12-07,000001,Vente,550000,,,LE CURTIL BOURGEON,B192,71290,71261,Loisy,71,,,712610000C0090,,,,,,,,,,,,,0,,,,,S,sols,,,580,5.024643,46.582504
2021-1196673,2021-12-07,000001,Vente,550000,,,A LOISY,B272,71290,71261,Loisy,71,,,712610000C0091,,,,,,,,,,,,,0,,,,,J,jardins,,,395,5.025342,46.582769
2021-1196673,2021-12-07,000001,Vente,550000,,,A LOISY,B272,71290,71261,Loisy,71,,,712610000C0092,,,,,,,,,,,,,0,,,,,J,jardins,,,535,5.025452,46.58245
2021-1196674,2021-12-03,000001,Vente,140000,1172,,RTE DU BOURG,0045,71290,71261,Loisy,71,,,712610000D0058,,,,,,,,,,,,,0,1,Maison,84,2,S,sols,,,1535,5.014858,46.578327
2021-1196674,2021-12-03,000001,Vente,140000,78,,RUE DU BIEF,0030,71290,71261,Loisy,71,,,712610000D0631,,,,,,,,,,,,,0,,,,,J,jardins,,,143,5.014841,46.57851
2021-1196674,2021-12-03,000001,Vente,140000,,,LA CONDEMINE,B179,71290,71261,Loisy,71,,,712610000D0632,,,,,,,,,,,,,0,,,,,P,prés,,,1201,5.015206,46.578384
2021-1196674,2021-12-03,000001,Vente,140000,,,LA CONDEMINE,B179,71290,71261,Loisy,71,,,712610000D0635,,,,,,,,,,,,,0,,,,,VI,vignes,,,11,5.015112,46.57854
2021-1196687,2021-11-02,000001,Vente,987,,,LES BELLES COULOMMES,B013,71290,71261,Loisy,71,,,712610000A1021,,,,,,,,,,,,,0,,,,,T,terres,,,7900,4.988321,46.591969
2021-1196700,2021-12-13,000001,Vente,154000,,,AU BOIS DES TILLIOTS,B047,71290,71261,Loisy,71,,,712610000E0833,,,,,,,,,,,,,0,,,,,T,terres,,,1030,4.98679,46.576959
2021-1196700,2021-12-13,000001,Vente,154000,,,AU BOIS DES TILLIOTS,B047,71290,71261,Loisy,71,,,712610000E0837,,,,,,,,,,,,,0,,,,,J,jardins,,,50,4.986804,46.577169
2021-1196700,2021-12-13,000001,Vente,154000,82,,RTE DE CHALON,0065,71290,71261,Loisy,71,,,712610000E0838,,,,,,,,,,,,,0,1,Maison,88,3,S,sols,,,1711,4.98648,46.576929
2021-1196701,2021-12-06,000002,Vente,2036,,,A LORMEY,B274,71290,71261,Loisy,71,,,712610000B0395,,,,,,,,,,,,,0,,,,,T,terres,,,3435,5.020639,46.581962
2021-1196701,2021-12-06,000002,Vente,2036,,,A LORMEY,B274,71290,71261,Loisy,71,,,712610000B0499,,,,,,,,,,,,,0,,,,,T,terres,,,11335,5.019677,46.582104
2021-1196720,2021-12-16,000001,Vente,200,,,A LOISY,B272,71290,71261,Loisy,71,,,712610000C0095,,,,,,,,,,,,,0,,,,,J,jardins,,,290,5.025618,46.582856
2021-1196720,2021-12-16,000001,Vente,200,,,A LOISY,B272,71290,71261,Loisy,71,,,712610000C0096,,,,,,,,,,,,,0,,,,,J,jardins,,,450,5.025725,46.58244
2021-1196720,2021-12-16,000001,Vente,200,,,A LOISY,B272,71290,71261,Loisy,71,,,712610000C0097,,,,,,,,,,,,,0,,,,,S,sols,,,696,5.025959,46.582167
2021-1196769,2021-12-17,000001,Vente,2420,,,LA GRANDE RIPPE,B245,71290,71261,Loisy,71,,,712610000A0318,,,,,,,,,,,,,0,,,,,BS,taillis sous futaie,,,3330,5.041313,46.612833
2021-1196809,2021-12-27,000001,Vente,585,,,RIPPE DE L HOMME,B395,71290,71261,Loisy,71,,,712610000A0348,,,,,,,,,,,,,0,,,,,BS,taillis sous futaie,,,2855,5.035691,46.610044
2021-1196809,2021-12-27,000001,Vente,585,,,BOIS DE LA SAULE,B034,71290,71261,Loisy,71,,,712610000A1132,,,,,,,,,,,,,0,,,,,BS,taillis sous futaie,,,7958,5.038029,46.612811
2021-1196809,2021-12-27,000001,Vente,585,,,LA CHAGNEE,B084,71290,71261,Loisy,71,,,712610000B0411,,,,,,,,,,,,,0,,,,,BS,taillis sous futaie,,,1672,5.023064,46.59776
