id_mutation,date_mutation,numero_disposition,nature_mutation,valeur_fonciere,adresse_numero,adresse_suffixe,adresse_nom_voie,adresse_code_voie,code_postal,code_commune,nom_commune,code_departement,ancien_code_commune,ancien_nom_commune,id_parcelle,ancien_id_parcelle,numero_volume,lot1_numero,lot1_surface_carrez,lot2_numero,lot2_surface_carrez,lot3_numero,lot3_surface_carrez,lot4_numero,lot4_surface_carrez,lot5_numero,lot5_surface_carrez,nombre_lots,code_type_local,type_local,surface_reelle_bati,nombre_pieces_principales,code_nature_culture,nature_culture,code_nature_culture_speciale,nature_culture_speciale,surface_terrain,longitude,latitude
2021-1194733,2021-01-26,000001,Vente,154000,2,,IMP DES RESERVES,0112,71440,71538,Thurey,71,,,715380000C0204,,,,,,,,,,,,,0,1,Maison,150,4,P,prés,,,947,5.148647,46.735797
2021-1194733,2021-01-26,000001,Vente,154000,2,,IMP DES RESERVES,0112,71440,71538,Thurey,71,,,715380000C0204,,,,,,,,,,,,,0,1,Maison,150,4,S,sols,,,2000,5.148647,46.735797
2021-1194733,2021-01-26,000001,Vente,154000,2,,IMP DES RESERVES,0112,71440,71538,Thurey,71,,,715380000C0204,,,,,,,,,,,,,0,3,Dépendance,,0,S,sols,,,2000,5.148647,46.735797
2021-1194733,2021-01-26,000001,Vente,154000,2,,IMP DES RESERVES,0112,71440,71538,Thurey,71,,,715380000C0204,,,,,,,,,,,,,0,3,Dépendance,,0,P,prés,,,947,5.148647,46.735797
2021-1194980,2021-03-24,000001,Vente,140000,3,,IMP DU GRAND CROULLY,0075,71440,71538,Thurey,71,,,715380000C0357,,,,,,,,,,,,,0,1,Maison,85,4,S,sols,,,1150,5.130384,46.744048
2021-1195129,2021-04-13,000001,Vente,75000,2,,IMP DU BOURG,0015,71440,71538,Thurey,71,,,71538000AB0030,,,,,,,,,,,,,0,3,Dépendance,,0,S,sols,,,1146,5.12257,46.743545
2021-1195129,2021-04-13,000001,Vente,75000,2,,IMP DU BOURG,0015,71440,71538,Thurey,71,,,71538000AB0030,,,,,,,,,,,,,0,1,Maison,87,4,S,sols,,,1146,5.12257,46.743545
2021-1195129,2021-04-13,000001,Vente,75000,,,LE BOURG,B018,71440,71538,Thurey,71,,,71538000AB0031,,,,,,,,,,,,,0,,,,,J,jardins,,,705,5.122613,46.743729
2021-1195131,2021-04-12,000001,Vente,7900,,,LE GRAND PIOCHY,B060,71440,71538,Thurey,71,,,715380000A0180,,,,,,,,,,,,,0,,,,,T,terres,,,19753,5.101752,46.763045
2021-1195131,2021-04-12,000001,Vente,7900,,,LE GRAND PIOCHY,B060,71440,71538,Thurey,71,,,715380000A0181,,,,,,,,,,,,,0,,,,,T,terres,,,19753,5.103114,46.762566
2021-1195256,2021-04-20,000001,Vente,70000,,,LE BOURG,B018,71440,71538,Thurey,71,,,71538000AB0028,,,,,,,,,,,,,0,,,,,J,jardins,,,672,5.122282,46.743655
2021-1195256,2021-04-20,000001,Vente,70000,4,,IMP DU BOURG,0015,71440,71538,Thurey,71,,,71538000AB0029,,,,,,,,,,,,,0,1,Maison,85,4,S,sols,,,387,5.122189,46.743484
2021-1195264,2021-04-21,000001,Vente,70000,1,,RTE DE CHALON,0025,71440,71538,Thurey,71,,,71538000AB0239,,,,,,,,,,,,,0,,,,,S,sols,,,1224,5.120652,46.742862
2021-1195546,2021-06-11,000001,Vente,100000,,,LES VERNES,B091,71440,71538,Thurey,71,,,715380000B0038,,,,,,,,,,,,,0,,,,,P,prés,,,10032,5.118078,46.747413
2021-1195546,2021-06-11,000001,Vente,100000,,,LES VERNES,B091,71440,71538,Thurey,71,,,715380000B0041,,,,,,,,,,,,,0,,,,,J,jardins,,,494,5.117139,46.747513
2021-1195546,2021-06-11,000001,Vente,100000,16,,RUE DES VERNES,0131,71440,71538,Thurey,71,,,715380000B0042,,,,,,,,,,,,,0,3,Dépendance,,0,S,sols,,,1356,5.117008,46.747641
2021-1195546,2021-06-11,000001,Vente,100000,16,,RUE DES VERNES,0131,71440,71538,Thurey,71,,,715380000B0042,,,,,,,,,,,,,0,1,Maison,64,3,S,sols,,,1356,5.117008,46.747641
2021-1195747,2021-07-15,000001,Vente,108000,10,,RUE DES VERNES,0131,71440,71538,Thurey,71,,,715380000B0030,,,,,,,,,,,,,0,1,Maison,70,2,S,sols,,,500,5.11896,46.746252
2021-1195747,2021-07-15,000001,Vente,108000,,,LES VERNES,B091,71440,71538,Thurey,71,,,715380000B0370,,,,,,,,,,,,,0,,,,,T,terres,,,1047,5.119731,46.745884
2021-1195747,2021-07-15,000001,Vente,108000,,,LES VERNES,B091,71440,71538,Thurey,71,,,715380000B0371,,,,,,,,,,,,,0,,,,,T,terres,,,137,5.120201,46.745663
2021-1195755,2021-07-15,000001,Vente,92500,,,LA FORET,B049,71440,71538,Thurey,71,,,715380000C0272,,,,,,,,,,,,,0,,,,,P,prés,,,3824,5.138337,46.738659
2021-1195755,2021-07-15,000001,Vente,92500,7,,RTE DE LOUHANS,0090,71440,71538,Thurey,71,,,715380000C0273,,,,,,,,,,,,,0,1,Maison,164,4,S,sols,,,4354,5.13725,46.739012
2021-1195755,2021-07-15,000001,Vente,92500,,,LA FORET,B049,71440,71538,Thurey,71,,,715380000C0277,,,,,,,,,,,,,0,,,,,P,prés,,,155,5.13821,46.73818
2021-1195755,2021-07-15,000001,Vente,92500,,,LE VILLEY,B095,71440,71538,Thurey,71,,,715380000C0279,,,,,,,,,,,,,0,,,,,S,sols,,,180,5.137641,46.738479
2021-1195847,2021-07-30,000001,Vente,243000,14,,RTE DE MONTRET,0100,71440,71538,Thurey,71,,,71538000AB0120,,,,,,,,,,,,,0,1,Maison,141,6,AG,terrains d'agrément,,,828,5.118432,46.741454
2021-1195847,2021-07-30,000001,Vente,243000,14,,RTE DE MONTRET,0100,71440,71538,Thurey,71,,,71538000AB0120,,,,,,,,,,,,,0,1,Maison,141,6,S,sols,,,1000,5.118432,46.741454
2021-1195953,2021-08-03,000001,Vente,145000,,,LE BOURG,B018,71440,71538,Thurey,71,,,71538000AC0140,,,,,,,,,,,,,0,,,,,J,jardins,,,481,5.124765,46.743251
2021-1195953,2021-08-03,000001,Vente,145000,6,,RTE DE SAINT GERMAIN DU BOIS,0115,71440,71538,Thurey,71,,,71538000AC0141,,,,,,,,,,,,,0,1,Maison,109,4,AG,terrains d'agrément,,,235,5.124606,46.743021
2021-1195953,2021-08-03,000001,Vente,145000,6,,RTE DE SAINT GERMAIN DU BOIS,0115,71440,71538,Thurey,71,,,71538000AC0141,,,,,,,,,,,,,0,1,Maison,109,4,S,sols,,,1000,5.124606,46.743021
2021-1195953,2021-08-03,000001,Vente,145000,,,LE BOURG,B018,71440,71538,Thurey,71,,,71538000AC0151,,,,,,,,,,,,,0,,,,,VE,vergers,,,1283,5.124811,46.742947
2021-1195989,2021-08-05,000001,Vente,30000,,,LES GUICHARDS,B067,71440,71538,Thurey,71,,,715380000B0399,,,,,,,,,,,,,0,,,,,P,prés,,,688,5.111761,46.734288
2021-1195989,2021-08-05,000001,Vente,30000,,,LES GUICHARDS,B067,71440,71538,Thurey,71,,,715380000B0402,,,,,,,,,,,,,0,,,,,S,sols,,,2949,5.112078,46.734293
2021-1195989,2021-08-05,000001,Vente,30000,,,LES GUICHARDS,B067,71440,71538,Thurey,71,,,715380000B0403,,,,,,,,,,,,,0,,,,,T,terres,,,374,5.112407,46.734538
2021-1196116,2021-09-13,000001,Vente,60000,,,LES PERNINS,B072,71440,71538,Thurey,71,,,71538000AC0043,,,,,,,,,,,,,0,,,,,S,sols,,,485,5.126623,46.739828
2021-1196116,2021-09-13,000001,Vente,60000,,,LES PERNINS,B072,71440,71538,Thurey,71,,,71538000AC0044,,,,,,,,,,,,,0,,,,,P,prés,,,861,5.126891,46.739739
2021-1196116,2021-09-13,000001,Vente,60000,,,LES PERNINS,B072,71440,71538,Thurey,71,,,71538000AC0047,,,,,,,,,,,,,0,,,,,T,terres,,,470,5.126606,46.739517
2021-1196116,2021-09-13,000001,Vente,60000,,,LES PERNINS,B072,71440,71538,Thurey,71,,,71538000AC0048,,,,,,,,,,,,,0,,,,,BT,taillis simples,ACACI,Acacias,545,5.126618,46.739003
2021-1196116,2021-09-13,000001,Vente,60000,,,LES PERNINS,B072,71440,71538,Thurey,71,,,71538000AC0049,,,,,,,,,,,,,0,,,,,VE,vergers,,,656,5.126422,46.739305
2021-1196116,2021-09-13,000001,Vente,60000,,,LES PERNINS,B072,71440,71538,Thurey,71,,,71538000AC0050,,,,,,,,,,,,,0,,,,,J,jardins,,,868,5.126241,46.739459
2021-1196116,2021-09-13,000001,Vente,60000,16,,LES PERNINS,A085,71440,71538,Thurey,71,,,71538000AC0052,,,,,,,,,,,,,0,3,Dépendance,,0,S,sols,,,1020,5.126057,46.739641
2021-1196116,2021-09-13,000001,Vente,60000,16,,LES PERNINS,A085,71440,71538,Thurey,71,,,71538000AC0052,,,,,,,,,,,,,0,1,Maison,157,4,S,sols,,,1020,5.126057,46.739641
2021-1196150,2021-09-20,000001,Vente,147520,,,LE ROLLET,B085,71440,71538,Thurey,71,,,71538000AB0125,,,,,,,,,,,,,0,,,,,S,sols,,,140,5.118875,46.741821
2021-1196150,2021-09-20,000001,Vente,147520,12,,RTE DE MONTRET,0100,71440,71538,Thurey,71,,,71538000AB0237,,,,,,,,,,,,,0,3,Dépendance,,0,AG,terrains d'agrément,,,308,5.11854,46.741888
2021-1196150,2021-09-20,000001,Vente,147520,12,,RTE DE MONTRET,0100,71440,71538,Thurey,71,,,71538000AB0237,,,,,,,,,,,,,0,3,Dépendance,,0,S,sols,,,1000,5.11854,46.741888
2021-1196150,2021-09-20,000001,Vente,147520,12,,RTE DE MONTRET,0100,71440,71538,Thurey,71,,,71538000AB0237,,,,,,,,,,,,,0,1,Maison,76,3,AG,terrains d'agrément,,,308,5.11854,46.741888
2021-1196150,2021-09-20,000001,Vente,147520,12,,RTE DE MONTRET,0100,71440,71538,Thurey,71,,,71538000AB0237,,,,,,,,,,,,,0,1,Maison,76,3,S,sols,,,1000,5.11854,46.741888
2021-1196151,2021-09-20,000001,Vente,215000,17,,RTE DE MONTRET,0100,71440,71538,Thurey,71,,,715380000B0289,,,,,,,,,,,,,0,1,Maison,132,5,S,sols,,,1345,5.11625,46.73964
2021-1196151,2021-09-20,000001,Vente,215000,17,,RTE DE MONTRET,0100,71440,71538,Thurey,71,,,715380000B0289,,,,,,,,,,,,,0,3,Dépendance,,0,S,sols,,,1345,5.11625,46.73964
2021-1196151,2021-09-20,000001,Vente,215000,17,,RTE DE MONTRET,0100,71440,71538,Thurey,71,,,715380000B0289,,,,,,,,,,,,,0,3,Dépendance,,0,S,sols,,,1345,5.11625,46.73964
2021-1196151,2021-09-20,000001,Vente,215000,,,LE CHAMP PANEY,B027,71440,71538,Thurey,71,,,715380000B0290,,,,,,,,,,,,,0,,,,,J,jardins,,,600,5.116478,46.739521
2021-1196151,2021-09-20,000001,Vente,215000,,,LE CHAMP PANEY,B027,71440,71538,Thurey,71,,,715380000B0290,,,,,,,,,,,,,0,,,,,T,terres,,,2174,5.116478,46.739521
2021-1196151,2021-09-20,000001,Vente,215000,,,LE CHAMP PANEY,B027,71440,71538,Thurey,71,,,715380000B0353,,,,,,,,,,,,,0,,,,,T,terres,,,914,5.116352,46.73915
2021-1196183,2021-09-29,000002,Vente,2385,,,LA GONNIERE,B056,71440,71538,Thurey,71,,,715380000B0442,,,,,,,,,,,,,0,,,,,P,prés,,,355,5.123562,46.745951
2021-1196183,2021-09-29,000002,Vente,2385,,,LA GONNIERE,B056,71440,71538,Thurey,71,,,715380000B0444,,,,,,,,,,,,,0,,,,,T,terres,,,440,5.12345,46.745833
2021-1196290,2021-10-22,000001,Vente,32500,2,A,RTE DE DICONNE,0050,71440,71538,Thurey,71,,,715380000C0393,,,,,,,,,,,,,0,1,Maison,142,4,S,sols,,,1200,5.124377,46.745579
2021-1196290,2021-10-22,000001,Vente,32500,2,A,RTE DE DICONNE,0050,71440,71538,Thurey,71,,,715380000C0393,,,,,,,,,,,,,0,1,Maison,142,4,AG,terrains d'agrément,,,1382,5.124377,46.745579
