id_mutation,date_mutation,numero_disposition,nature_mutation,valeur_fonciere,adresse_numero,adresse_suffixe,adresse_nom_voie,adresse_code_voie,code_postal,code_commune,nom_commune,code_departement,ancien_code_commune,ancien_nom_commune,id_parcelle,ancien_id_parcelle,numero_volume,lot1_numero,lot1_surface_carrez,lot2_numero,lot2_surface_carrez,lot3_numero,lot3_surface_carrez,lot4_numero,lot4_surface_carrez,lot5_numero,lot5_surface_carrez,nombre_lots,code_type_local,type_local,surface_reelle_bati,nombre_pieces_principales,code_nature_culture,nature_culture,code_nature_culture_speciale,nature_culture_speciale,surface_terrain,longitude,latitude
2021-1197451,2021-01-11,000002,Vente,600,,,LES FRAICHES,B218,72270,72100,Courcelles-la-Forêt,72,,,721000000A0259,,,,,,,,,,,,,0,,,,,BP,peupleraies,,,937,-0.006402,47.807633
2021-1197451,2021-01-11,000002,Vente,600,,,LES FRAICHES,B218,72270,72100,Courcelles-la-Forêt,72,,,721000000A0683,,,,,,,,,,,,,0,,,,,BP,peupleraies,,,1150,,
2021-1198050,2021-02-17,000001,Vente,220000,5111,,LA PETITE CHEVALLERIE,B455,72270,72100,Courcelles-la-Forêt,72,,,72100000ZD0008,,,,,,,,,,,,,0,1,Maison,163,7,J,jardins,POTAG,Jardin potager,1080,-0.02233,47.781736
2021-1198050,2021-02-17,000001,Vente,220000,5111,,LA PETITE CHEVALLERIE,B455,72270,72100,Courcelles-la-Forêt,72,,,72100000ZD0008,,,,,,,,,,,,,0,1,Maison,163,7,S,sols,,,2920,-0.02233,47.781736
2021-1198050,2021-02-17,000001,Vente,220000,,,LA PETITE CHEVALLERIE,B455,72270,72100,Courcelles-la-Forêt,72,,,72100000ZD0009,,,,,,,,,,,,,0,,,,,P,prés,,,12040,-0.021883,47.781308
2021-1198050,2021-02-17,000001,Vente,220000,,,LA PETITE CHEVALLERIE,B455,72270,72100,Courcelles-la-Forêt,72,,,72100000ZD0009,,,,,,,,,,,,,0,,,,,BR,futaies résineuses,PIN,Pins,3800,-0.021883,47.781308
2021-1198050,2021-02-17,000001,Vente,220000,,,LA PETITE CHEVALLERIE,B455,72270,72100,Courcelles-la-Forêt,72,,,72100000ZD0009,,,,,,,,,,,,,0,,,,,BR,futaies résineuses,PIN,Pins,21300,-0.021883,47.781308
2021-1198050,2021-02-17,000001,Vente,220000,,,LA PETITE CHEVALLERIE,B455,72270,72100,Courcelles-la-Forêt,72,,,72100000ZD0010,,,,,,,,,,,,,0,,,,,BR,futaies résineuses,PIN,Pins,10530,-0.021169,47.782938
2021-1198136,2021-01-25,000001,Vente,600,,,LES FRAICHES,B218,72270,72100,Courcelles-la-Forêt,72,,,721000000A0684,,,,,,,,,,,,,0,,,,,BP,peupleraies,,,2139,,
2021-1199746,2021-03-30,000001,Vente,11993,,,LE SABLON,B596,72270,72100,Courcelles-la-Forêt,72,,,721000000B0098,,,,,,,,,,,,,0,,,,,P,prés,,,29982,-0.023293,47.790731
2021-1200176,2021-04-07,000001,Vente,107000,5089,B,LE BAS DU TERTRE,B011,72270,72100,Courcelles-la-Forêt,72,,,72100000AB0133,,,,,,,,,,,,,0,1,Maison,113,5,S,sols,,,762,-0.016195,47.7877
2021-1200176,2021-04-07,000001,Vente,107000,5089,B,LE BAS DU TERTRE,B011,72270,72100,Courcelles-la-Forêt,72,,,72100000AB0133,,,,,,,,,,,,,0,3,Dépendance,,0,S,sols,,,762,-0.016195,47.7877
2021-1200176,2021-04-07,000001,Vente,107000,5089,B,LE BAS DU TERTRE,B011,72270,72100,Courcelles-la-Forêt,72,,,72100000AB0133,,,,,,,,,,,,,0,3,Dépendance,,0,S,sols,,,762,-0.016195,47.7877
2021-1200176,2021-04-07,000001,Vente,107000,5089,B,LE BAS DU TERTRE,B011,72270,72100,Courcelles-la-Forêt,72,,,72100000AB0133,,,,,,,,,,,,,0,3,Dépendance,,0,S,sols,,,762,-0.016195,47.7877
2021-1200232,2021-03-25,000001,Vente,48000,,,LA MERCERIE,B374,72270,72100,Courcelles-la-Forêt,72,,,72100000AB0005,,,,,,,,,,,,,0,,,,,S,sols,,,94,-0.015338,47.787122
2021-1200232,2021-03-25,000001,Vente,48000,,,LA MERCERIE,B374,72270,72100,Courcelles-la-Forêt,72,,,72100000AB0005,,,,,,,,,,,,,0,,,,,J,jardins,POTAG,Jardin potager,404,-0.015338,47.787122
2021-1200232,2021-03-25,000001,Vente,48000,5029,,LA MERCERIE,B374,72270,72100,Courcelles-la-Forêt,72,,,72100000AB0209,,,,,,,,,,,,,0,1,Maison,84,3,S,sols,,,991,-0.015371,47.787213
2021-1200232,2021-03-25,000001,Vente,48000,,,LE JARDIN,B324,72270,72100,Courcelles-la-Forêt,72,,,72100000AB0211,,,,,,,,,,,,,0,,,,,S,sols,,,49,-0.015644,47.787288
2021-1200239,2021-03-23,000001,Vente,1000,,,L EPINAY,B197,72270,72100,Courcelles-la-Forêt,72,,,721000000C0393,,,,,,,,,,,,,0,,,,,P,prés,,,4691,-0.052093,47.791478
2021-1202093,2021-05-18,000001,Vente,1000,5033,,LE TERTRE,B622,72270,72100,Courcelles-la-Forêt,72,,,72100000AB0194,,,,,,,,,,,,,0,3,Dépendance,,0,S,sols,,,95,-0.016867,47.785945
2021-1203958,2021-06-14,000001,Vente,53500,47,,RUE DU BOURG FLEURI,0010,72270,72100,Courcelles-la-Forêt,72,,,72100000AB0103,,,,,,,,,,,,,0,1,Maison,90,5,S,sols,,,392,-0.017628,47.785241
2021-1203958,2021-06-14,000001,Vente,53500,47,,RUE DU BOURG FLEURI,0010,72270,72100,Courcelles-la-Forêt,72,,,72100000AB0103,,,,,,,,,,,,,0,4,Local industriel. commercial ou assimilé,60,0,S,sols,,,392,-0.017628,47.785241
2021-1207525,2021-09-10,000001,Vente,70000,17,,RUE DU BOURG FLEURI,0010,72270,72100,Courcelles-la-Forêt,72,,,72100000AB0227,,,,,,,,,,,,,0,3,Dépendance,,0,S,sols,,,638,-0.018079,47.784127
2021-1207525,2021-09-10,000001,Vente,70000,17,,RUE DU BOURG FLEURI,0010,72270,72100,Courcelles-la-Forêt,72,,,72100000AB0227,,,,,,,,,,,,,0,1,Maison,120,4,S,sols,,,638,-0.018079,47.784127
2021-1209350,2021-10-22,000001,Vente,164000,5134,,LA MOLLEE,B379,72270,72100,Courcelles-la-Forêt,72,,,721000000C0490,,,,,,,,,,,,,0,3,Dépendance,,0,S,sols,,,153,-0.052995,47.785755
2021-1209350,2021-10-22,000001,Vente,164000,5134,,LA MOLLEE,B379,72270,72100,Courcelles-la-Forêt,72,,,721000000C0490,,,,,,,,,,,,,0,1,Maison,70,3,S,sols,,,153,-0.052995,47.785755
2021-1209350,2021-10-22,000001,Vente,164000,5134,,LA MOLLEE,B379,72270,72100,Courcelles-la-Forêt,72,,,721000000C0490,,,,,,,,,,,,,0,3,Dépendance,,0,S,sols,,,153,-0.052995,47.785755
2021-1209350,2021-10-22,000001,Vente,164000,5134,,LA MOLLEE,B379,72270,72100,Courcelles-la-Forêt,72,,,721000000C0490,,,,,,,,,,,,,0,3,Dépendance,,0,S,sols,,,153,-0.052995,47.785755
2021-1209350,2021-10-22,000001,Vente,164000,5134,,LA MOLLEE,B379,72270,72100,Courcelles-la-Forêt,72,,,721000000C0490,,,,,,,,,,,,,0,3,Dépendance,,0,S,sols,,,153,-0.052995,47.785755
2021-1209350,2021-10-22,000001,Vente,164000,5134,,LA MOLLEE,B379,72270,72100,Courcelles-la-Forêt,72,,,721000000C0490,,,,,,,,,,,,,0,3,Dépendance,,0,T,terres,,,1861,-0.052995,47.785755
2021-1209350,2021-10-22,000001,Vente,164000,5134,,LA MOLLEE,B379,72270,72100,Courcelles-la-Forêt,72,,,721000000C0490,,,,,,,,,,,,,0,1,Maison,70,3,T,terres,,,1861,-0.052995,47.785755
2021-1209350,2021-10-22,000001,Vente,164000,5134,,LA MOLLEE,B379,72270,72100,Courcelles-la-Forêt,72,,,721000000C0490,,,,,,,,,,,,,0,3,Dépendance,,0,T,terres,,,1861,-0.052995,47.785755
2021-1209350,2021-10-22,000001,Vente,164000,5134,,LA MOLLEE,B379,72270,72100,Courcelles-la-Forêt,72,,,721000000C0490,,,,,,,,,,,,,0,3,Dépendance,,0,T,terres,,,1861,-0.052995,47.785755
2021-1209350,2021-10-22,000001,Vente,164000,5134,,LA MOLLEE,B379,72270,72100,Courcelles-la-Forêt,72,,,721000000C0490,,,,,,,,,,,,,0,3,Dépendance,,0,T,terres,,,1861,-0.052995,47.785755
2021-1209350,2021-10-22,000001,Vente,164000,,,GRAND SAVIGNE,B268,72270,72100,Courcelles-la-Forêt,72,,,721000000C0505,,,,,,,,,,,,,0,,,,,T,terres,,,4236,-0.052844,47.786288
2021-1212456,2021-04-06,000001,Adjudication,70500,,,CHAMP DE LA GRANGE,B078,72270,72100,Courcelles-la-Forêt,72,,,721000000C0217,,,,,,,,,,,,,0,,,,,T,terres,,,4652,-0.052363,47.788485
2021-1212456,2021-04-06,000001,Adjudication,70500,5137,,LE SABLONET,B597,72270,72100,Courcelles-la-Forêt,72,,,721000000C0218,,,,,,,,,,,,,0,1,Maison,113,3,S,sols,,,788,-0.052084,47.788753
2021-1212456,2021-04-06,000001,Adjudication,70500,,,LE SABLONET,B597,72270,72100,Courcelles-la-Forêt,72,,,721000000C0219,,,,,,,,,,,,,0,,,,,S,sols,,,16,-0.051578,47.788776
2021-1212456,2021-04-06,000001,Adjudication,70500,,,LE GRAND VIEUX PRE,B272,72270,72100,Courcelles-la-Forêt,72,,,721000000C0220,,,,,,,,,,,,,0,,,,,P,prés,,,13820,-0.051763,47.78795
2021-1212456,2021-04-06,000001,Adjudication,70500,,,LA PRISE,B574,72270,72100,Courcelles-la-Forêt,72,,,721000000C0221,,,,,,,,,,,,,0,,,,,T,terres,,,13543,-0.051062,47.788093
2021-1212456,2021-04-06,000001,Adjudication,70500,,,LA PRISE,B574,72270,72100,Courcelles-la-Forêt,72,,,721000000C0222,,,,,,,,,,,,,0,,,,,VI,vignes,,,1431,-0.050059,47.787895
