id_mutation,date_mutation,numero_disposition,nature_mutation,valeur_fonciere,adresse_numero,adresse_suffixe,adresse_nom_voie,adresse_code_voie,code_postal,code_commune,nom_commune,code_departement,ancien_code_commune,ancien_nom_commune,id_parcelle,ancien_id_parcelle,numero_volume,lot1_numero,lot1_surface_carrez,lot2_numero,lot2_surface_carrez,lot3_numero,lot3_surface_carrez,lot4_numero,lot4_surface_carrez,lot5_numero,lot5_surface_carrez,nombre_lots,code_type_local,type_local,surface_reelle_bati,nombre_pieces_principales,code_nature_culture,nature_culture,code_nature_culture_speciale,nature_culture_speciale,surface_terrain,longitude,latitude
2021-1197107,2021-01-04,000001,Vente,68000,,,CR DU PORTAIL,0490,72110,72281,Saint-Georges-du-Rosay,72,,,72281000AB0026,,,,,,,,,,,,,0,,,,,S,sols,,,707,0.501419,48.200186
2021-1197107,2021-01-04,000001,Vente,68000,2,,CR DU PORTAIL,0490,72110,72281,Saint-Georges-du-Rosay,72,,,72281000AB0033,,,,,,,,,,,,,0,1,Maison,89,3,S,sols,,,177,0.501301,48.200362
2021-1197107,2021-01-04,000001,Vente,68000,,,CR DU PORTAIL,0490,72110,72281,Saint-Georges-du-Rosay,72,,,72281000AB0034,,,,,,,,,,,,,0,,,,,J,jardins,POTAG,Jardin potager,687,0.501206,48.200486
2021-1197107,2021-01-04,000001,Vente,68000,,,CR DU PORTAIL,0490,72110,72281,Saint-Georges-du-Rosay,72,,,72281000AB0035,,,,,,,,,,,,,0,,,,,P,prés,,,328,0.500973,48.200459
2021-1197432,2021-01-26,000001,Vente,190000,5241,,LE PLESSIS,B672,72110,72281,Saint-Georges-du-Rosay,72,,,722810000A0835,,,,,,,,,,,,,0,1,Maison,160,5,S,sols,,,1359,0.510569,48.208981
2021-1197433,2021-02-02,000001,Vente,3000,,,LE GRAND PRE,B448,72110,72281,Saint-Georges-du-Rosay,72,,,722810000C0373,,,,,,,,,,,,,0,,,,,E,eaux,ETANG,Etangs,3500,0.496961,48.197397
2021-1197433,2021-02-02,000001,Vente,3000,,,LE GRAND PRE,B448,72110,72281,Saint-Georges-du-Rosay,72,,,722810000C0383,,,,,,,,,,,,,0,,,,,E,eaux,ETANG,Etangs,2020,0.497747,48.197229
2021-1198572,2021-02-18,000001,Vente,122000,5235,,LES BESNARDIERES,B025,72110,72281,Saint-Georges-du-Rosay,72,,,722810000C0613,,,,,,,,,,,,,0,1,Maison,72,3,T,terres,,,2550,0.509636,48.19329
2021-1198572,2021-02-18,000001,Vente,122000,5235,,LES BESNARDIERES,B025,72110,72281,Saint-Georges-du-Rosay,72,,,722810000C0613,,,,,,,,,,,,,0,1,Maison,72,3,S,sols,,,500,0.509636,48.19329
2021-1199149,2021-03-15,000001,Vente,68000,5211,,LA PETITE FONTAINE,B651,72110,72281,Saint-Georges-du-Rosay,72,,,722810000C0371,,,,,,,,,,,,,0,1,Maison,61,3,S,sols,,,510,0.498094,48.197575
2021-1199149,2021-03-15,000001,Vente,68000,,,LE JARDIN,B487,72110,72281,Saint-Georges-du-Rosay,72,,,722810000C0372,,,,,,,,,,,,,0,,,,,T,terres,,,1610,0.49782,48.197457
2021-1199257,2021-03-22,000001,Vente,73540.9,,,LE CHATAIGNIER,B216,72110,72281,Saint-Georges-du-Rosay,72,,,722810000C0702,,,,,,,,,,,,,0,,,,,S,sols,,,318,0.508136,48.189676
2021-1199257,2021-03-22,000001,Vente,73540.9,5253,,LE CHATAIGNIER,B216,72110,72281,Saint-Georges-du-Rosay,72,,,722810000C0704,,,,,,,,,,,,,0,1,Maison,54,3,S,sols,,,1637,0.507831,48.189932
2021-1199257,2021-03-22,000001,Vente,73540.9,,,LE CHAMP DE ROULETTE,B175,72110,72281,Saint-Georges-du-Rosay,72,,,722810000C0715,,,,,,,,,,,,,0,,,,,S,sols,,,95,0.507815,48.190163
2021-1199611,2021-03-22,000001,Vente,138000,,,JARDIN DU HAUT CHAPEAU,B546,72110,72281,Saint-Georges-du-Rosay,72,,,722810000C0400,,,,,,,,,,,,,0,,,,,S,sols,,,10,0.499767,48.193449
2021-1199611,2021-03-22,000001,Vente,138000,,,JARDIN DU HAUT CHAPEAU,B546,72110,72281,Saint-Georges-du-Rosay,72,,,722810000C0400,,,,,,,,,,,,,0,,,,,J,jardins,POTAG,Jardin potager,568,0.499767,48.193449
2021-1199611,2021-03-22,000001,Vente,138000,5203,,LE HAUT CHAPEAU,B479,72110,72281,Saint-Georges-du-Rosay,72,,,722810000C0655,,,,,,,,,,,,,0,1,Maison,130,4,S,sols,,,291,0.499805,48.193288
2021-1199757,2021-04-06,000001,Vente,110500,2,,PL DE L EGLISE,0175,72110,72281,Saint-Georges-du-Rosay,72,,,72281000AB0209,,,,,,,,,,,,,0,1,Maison,97,5,S,sols,,,650,0.501273,48.1993
2021-1200785,2021-04-29,000001,Vente,22300,5207,,LA COUPERIE,B355,72110,72281,Saint-Georges-du-Rosay,72,,,722810000C0585,,,,,,,,,,,,,0,1,Maison,54,2,S,sols,,,975,0.498013,48.194971
2021-1201133,2021-04-26,000002,Echange,180,,,LE CLOSEAU,B321,72110,72281,Saint-Georges-du-Rosay,72,,,722810000A0891,,,,,,,,,,,,,0,,,,,T,terres,,,1184,0.522021,48.209949
2021-1201133,2021-04-26,000003,Echange,180,,,LE CHAMP PAUMIER,B277,72110,72281,Saint-Georges-du-Rosay,72,,,722810000A0889,,,,,,,,,,,,,0,,,,,T,terres,,,1215,0.522181,48.210413
2021-1201913,2021-05-12,000001,Vente,59143.4,,,LA MOUCHETIERE,B588,72110,72281,Saint-Georges-du-Rosay,72,,,722810000A0022,,,,,,,,,,,,,0,,,,,P,prés,,,24250,0.499195,48.211161
2021-1201913,2021-05-12,000001,Vente,59143.4,,,LA MOUCHETIERE,B588,72110,72281,Saint-Georges-du-Rosay,72,,,722810000A0023,,,,,,,,,,,,,0,,,,,P,prés,,,18657,0.498243,48.209582
2021-1201913,2021-05-12,000001,Vente,59143.4,,,LA GROUAS,B472,72110,72281,Saint-Georges-du-Rosay,72,,,722810000A0024,,,,,,,,,,,,,0,,,,,P,prés,,,7100,0.499684,48.210401
2021-1201913,2021-05-12,000001,Vente,59143.4,,,LA GROUAS,B472,72110,72281,Saint-Georges-du-Rosay,72,,,722810000A0025,,,,,,,,,,,,,0,,,,,P,prés,,,24270,0.500873,48.211359
2021-1201913,2021-05-12,000001,Vente,59143.4,,,LES BREBIONS,B059,72110,72281,Saint-Georges-du-Rosay,72,,,722810000A0796,,,,,,,,,,,,,0,,,,,P,prés,,,47599,0.501622,48.208896
2021-1201913,2021-05-12,000001,Vente,59143.4,,,LA FABRIQUE,B389,72110,72281,Saint-Georges-du-Rosay,72,,,722810000A0841,,,,,,,,,,,,,0,,,,,P,prés,,,8540,0.501918,48.211265
2021-1201913,2021-05-12,000001,Vente,59143.4,,,LA FABRIQUE,B389,72110,72281,Saint-Georges-du-Rosay,72,,,722810000A0842,,,,,,,,,,,,,0,,,,,P,prés,,,1036,0.501601,48.211465
2021-1202663,2021-05-31,000001,Vente,89500,,,LA MARE,B573,72110,72281,Saint-Georges-du-Rosay,72,,,722810000C0355,,,,,,,,,,,,,0,,,,,E,eaux,MARE,Mare,640,0.494913,48.197532
2021-1202663,2021-05-31,000001,Vente,89500,5215,,GUERINET,B474,72110,72281,Saint-Georges-du-Rosay,72,,,722810000C0558,,,,,,,,,,,,,0,1,Maison,104,5,S,sols,,,221,0.494896,48.197955
2021-1202663,2021-05-31,000001,Vente,89500,,,GUERINET,B474,72110,72281,Saint-Georges-du-Rosay,72,,,722810000C0632,,,,,,,,,,,,,0,,,,,S,sols,,,89,0.494989,48.197888
2021-1202663,2021-05-31,000001,Vente,89500,,,GUERINET,B474,72110,72281,Saint-Georges-du-Rosay,72,,,722810000C0808,,,,,,,,,,,,,0,,,,,S,sols,,,507,0.494669,48.197567
2021-1202728,2021-06-14,000002,Vente,8800,,,LE CHAMP DES CARREAUX,B184,72110,72281,Saint-Georges-du-Rosay,72,,,722810000A0909,,,,,,,,,,,,,0,,,,,P,prés,,,3084,0.528999,48.211505
2021-1204499,2021-07-01,000001,Vente,131582,,,LA COUTIERE,B357,72110,72281,Saint-Georges-du-Rosay,72,,,722810000A0452,,,,,,,,,,,,,0,,,,,P,prés,,,1916,0.540177,48.219406
2021-1204499,2021-07-01,000001,Vente,131582,,,LA COUTIERE,B357,72110,72281,Saint-Georges-du-Rosay,72,,,722810000A0453,,,,,,,,,,,,,0,,,,,BS,taillis sous futaie,,,984,0.540315,48.219179
2021-1204499,2021-07-01,000001,Vente,131582,,,LES GROISES,B471,72110,72281,Saint-Georges-du-Rosay,72,,,722810000A0591,,,,,,,,,,,,,0,,,,,P,prés,,,20561,,
2021-1204499,2021-07-01,000001,Vente,131582,,,LES PATURES,B607,72110,72281,Saint-Georges-du-Rosay,72,,,722810000A0593,,,,,,,,,,,,,0,,,,,P,prés,,,9404,,
2021-1204499,2021-07-01,000001,Vente,131582,,,LES RIEUX,B714,72110,72281,Saint-Georges-du-Rosay,72,,,722810000A0687,,,,,,,,,,,,,0,,,,,P,prés,,,452,0.543567,48.219085
2021-1204499,2021-07-01,000001,Vente,131582,,,LES PATURES,B607,72110,72281,Saint-Georges-du-Rosay,72,,,722810000A0690,,,,,,,,,,,,,0,,,,,P,prés,,,288,0.539692,48.219315
2021-1204500,2021-07-01,000002,Vente,126418,,,LE BAS DU PERRAY,B016,72110,72281,Saint-Georges-du-Rosay,72,,,722810000A0439,,,,,,,,,,,,,0,,,,,L,landes,BROUS,Broussailles ou buissons,950,0.548182,48.21874
2021-1204500,2021-07-01,000002,Vente,126418,,,BAS DU CHAMP DE LA GRANGE,B015,72110,72281,Saint-Georges-du-Rosay,72,,,722810000A0440,,,,,,,,,,,,,0,,,,,P,prés,,,2500,0.546467,48.219029
2021-1204500,2021-07-01,000002,Vente,126418,,,LES PETITS PRES,B662,72110,72281,Saint-Georges-du-Rosay,72,,,722810000A0441,,,,,,,,,,,,,0,,,,,P,prés,,,650,0.545074,48.219202
2021-1204500,2021-07-01,000002,Vente,126418,,,CHAMP DE LA GRANGE,B149,72110,72281,Saint-Georges-du-Rosay,72,,,722810000A0442,,,,,,,,,,,,,0,,,,,P,prés,,,19151,0.547303,48.21881
2021-1204500,2021-07-01,000002,Vente,126418,,,LES RIEUX,B714,72110,72281,Saint-Georges-du-Rosay,72,,,722810000A0451,,,,,,,,,,,,,0,,,,,P,prés,,,13883,0.542018,48.219399
2021-1204500,2021-07-01,000002,Vente,126418,,,LA COUTIERE,B357,72110,72281,Saint-Georges-du-Rosay,72,,,722810000A0454,,,,,,,,,,,,,0,,,,,BS,taillis sous futaie,,,1321,0.540244,48.219094
2021-1204500,2021-07-01,000002,Vente,126418,,,LE BOIS,B035,72110,72281,Saint-Georges-du-Rosay,72,,,722810000A0471,,,,,,,,,,,,,0,,,,,BS,taillis sous futaie,,,5250,0.546638,48.213134
2021-1206432,2021-08-31,000001,Vente,1000,5230,,RUE DE LA BUTTE,0090,72110,72281,Saint-Georges-du-Rosay,72,,,72281000AB0053,,,,,,,,,,,,,0,3,Dépendance,,0,S,sols,,,38,0.502294,48.201058
2021-1208031,2021-09-27,000001,Vente,800,,,LE CHAMP DES HAISES,B191,72110,72281,Saint-Georges-du-Rosay,72,,,722810000C0513,,,,,,,,,,,,,0,,,,,P,prés,,,5100,0.497885,48.193316
2021-1208989,2021-10-05,000001,Vente,68000,5245,,LA CANTINIERE,B075,72110,72281,Saint-Georges-du-Rosay,72,,,722810000A0073,,,,,,,,,,,,,0,1,Maison,56,2,P,prés,,,4200,0.503026,48.205572
2021-1208989,2021-10-05,000001,Vente,68000,5245,,LA CANTINIERE,B075,72110,72281,Saint-Georges-du-Rosay,72,,,722810000A0073,,,,,,,,,,,,,0,1,Maison,56,2,S,sols,,,550,0.503026,48.205572
2021-1208989,2021-10-05,000001,Vente,68000,,,LA CANTINIERE,B075,72110,72281,Saint-Georges-du-Rosay,72,,,722810000A0074,,,,,,,,,,,,,0,,,,,P,prés,,,670,0.503649,48.206047
2021-1208989,2021-10-05,000001,Vente,68000,,,LA CANTINIERE,B075,72110,72281,Saint-Georges-du-Rosay,72,,,722810000A0858,,,,,,,,,,,,,0,,,,,P,prés,,,1845,0.503477,48.206154
2021-1208989,2021-10-05,000001,Vente,68000,5277,,LA CANTINIERE,B075,72110,72281,Saint-Georges-du-Rosay,72,,,722810000A0859,,,,,,,,,,,,,0,3,Dépendance,,0,P,prés,,,2585,0.502303,48.206125
2021-1209075,2021-09-29,000001,Vente,94000,4,,RTE DE LA BOSSE,0035,72110,72281,Saint-Georges-du-Rosay,72,,,72281000AB0170,,,,,,,,,,,,,0,1,Maison,32,1,S,sols,,,682,0.501274,48.199123
2021-1209075,2021-09-29,000001,Vente,94000,,,RTE DE LA BOSSE,0035,72110,72281,Saint-Georges-du-Rosay,72,,,72281000AB0171,,,,,,,,,,,,,0,,,,,E,eaux,MARE,Mare,55,0.500924,48.199094
2021-1209075,2021-09-29,000001,Vente,94000,2,,RTE DE LA BOSSE,0035,72110,72281,Saint-Georges-du-Rosay,72,,,72281000AB0210,,,,,,,,,,,,,0,1,Maison,110,4,S,sols,,,145,0.501465,48.199261
2021-1209123,2021-10-04,000002,Vente,80000,,,LE BAS DU PERRAY,B016,72110,72281,Saint-Georges-du-Rosay,72,,,722810000A0439,,,,,,,,,,,,,0,,,,,L,landes,BROUS,Broussailles ou buissons,950,0.548182,48.21874
2021-1209123,2021-10-04,000002,Vente,80000,,,BAS DU CHAMP DE LA GRANGE,B015,72110,72281,Saint-Georges-du-Rosay,72,,,722810000A0440,,,,,,,,,,,,,0,,,,,P,prés,,,2500,0.546467,48.219029
2021-1209123,2021-10-04,000002,Vente,80000,,,LES PETITS PRES,B662,72110,72281,Saint-Georges-du-Rosay,72,,,722810000A0441,,,,,,,,,,,,,0,,,,,P,prés,,,650,0.545074,48.219202
2021-1209123,2021-10-04,000002,Vente,80000,,,CHAMP DE LA GRANGE,B149,72110,72281,Saint-Georges-du-Rosay,72,,,722810000A0442,,,,,,,,,,,,,0,,,,,P,prés,,,19151,0.547303,48.21881
2021-1209123,2021-10-04,000002,Vente,80000,,,LES RIEUX,B714,72110,72281,Saint-Georges-du-Rosay,72,,,722810000A0451,,,,,,,,,,,,,0,,,,,P,prés,,,13883,0.542018,48.219399
2021-1209123,2021-10-04,000002,Vente,80000,,,LA COUTIERE,B357,72110,72281,Saint-Georges-du-Rosay,72,,,722810000A0452,,,,,,,,,,,,,0,,,,,P,prés,,,1916,0.540177,48.219406
2021-1209123,2021-10-04,000002,Vente,80000,,,LA COUTIERE,B357,72110,72281,Saint-Georges-du-Rosay,72,,,722810000A0453,,,,,,,,,,,,,0,,,,,BS,taillis sous futaie,,,984,0.540315,48.219179
2021-1209123,2021-10-04,000002,Vente,80000,,,LA COUTIERE,B357,72110,72281,Saint-Georges-du-Rosay,72,,,722810000A0454,,,,,,,,,,,,,0,,,,,BS,taillis sous futaie,,,1321,0.540244,48.219094
2021-1209123,2021-10-04,000002,Vente,80000,,,LES RIEUX,B714,72110,72281,Saint-Georges-du-Rosay,72,,,722810000A0687,,,,,,,,,,,,,0,,,,,P,prés,,,452,0.543567,48.219085
2021-1209123,2021-10-04,000002,Vente,80000,,,LES PATURES,B607,72110,72281,Saint-Georges-du-Rosay,72,,,722810000A0690,,,,,,,,,,,,,0,,,,,P,prés,,,288,0.539692,48.219315
2021-1209123,2021-10-04,000002,Vente,80000,,,LES GROISES,B471,72110,72281,Saint-Georges-du-Rosay,72,,,722810000A0911,,,,,,,,,,,,,0,,,,,P,prés,,,116,0.538084,48.219414
2021-1209123,2021-10-04,000002,Vente,80000,,,LES GROISES,B471,72110,72281,Saint-Georges-du-Rosay,72,,,722810000A0912,,,,,,,,,,,,,0,,,,,P,prés,,,345,0.538368,48.21902
2021-1209123,2021-10-04,000002,Vente,80000,,,LES PATURES,B607,72110,72281,Saint-Georges-du-Rosay,72,,,722810000A0914,,,,,,,,,,,,,0,,,,,P,prés,,,8029,0.538774,48.219277
2021-1209200,2021-10-27,000001,Vente,1000,5003,,RUE DE LA BUTTE,0090,72110,72281,Saint-Georges-du-Rosay,72,,,72281000AB0052,,,,,,,,,,,,,0,3,Dépendance,,0,S,sols,,,70,0.502211,48.201005
2021-1210094,2021-11-05,000001,Vente,55000,5140,,BOURDELAINE,B054,72110,72281,Saint-Georges-du-Rosay,72,,,722810000A0521,,,,,,,,,,,,,0,3,Dépendance,,0,S,sols,,,1811,0.53207,48.209309
2021-1210094,2021-11-05,000001,Vente,55000,5140,,BOURDELAINE,B054,72110,72281,Saint-Georges-du-Rosay,72,,,722810000A0521,,,,,,,,,,,,,0,1,Maison,54,1,S,sols,,,1811,0.53207,48.209309
2021-1210094,2021-11-05,000001,Vente,55000,,,LE GRAND JARDIN,B442,72110,72281,Saint-Georges-du-Rosay,72,,,722810000A0522,,,,,,,,,,,,,0,,,,,T,terres,,,1449,0.532352,48.208843
2021-1210094,2021-11-05,000001,Vente,55000,,,CHAMP DE DEVANT,B119,72110,72281,Saint-Georges-du-Rosay,72,,,722810000A0523,,,,,,,,,,,,,0,,,,,T,terres,,,20500,0.530395,48.208982
2021-1210474,2021-11-25,000001,Vente,152475,5233,,LA HAIZE,B478,72110,72281,Saint-Georges-du-Rosay,72,,,722810000C0521,,,,,,,,,,,,,0,1,Maison,90,2,S,sols,,,499,0.49422,48.192921
2021-1210474,2021-11-25,000001,Vente,152475,,,JARDIN DE LA HAISE,B510,72110,72281,Saint-Georges-du-Rosay,72,,,722810000C0522,,,,,,,,,,,,,0,,,,,J,jardins,POTAG,Jardin potager,579,0.493588,48.192771
2021-1210474,2021-11-25,000001,Vente,152475,,,LA HAIZE,B478,72110,72281,Saint-Georges-du-Rosay,72,,,722810000C0523,,,,,,,,,,,,,0,,,,,S,sols,,,873,0.493939,48.192976
2021-1210474,2021-11-25,000001,Vente,152475,,,LE CHAMP D EN HAUT,B103,72110,72281,Saint-Georges-du-Rosay,72,,,722810000C0590,,,,,,,,,,,,,0,,,,,P,prés,,,365,0.494587,48.192592
2021-1210474,2021-11-25,000001,Vente,152475,,,LE GRISON,B754,72110,72281,Saint-Georges-du-Rosay,72,,,722810000C0593,,,,,,,,,,,,,0,,,,,AG,terrains d'agrément,,,1658,0.494378,48.192741
2021-1210474,2021-11-25,000001,Vente,152475,,,LE GRISON,B754,72110,72281,Saint-Georges-du-Rosay,72,,,722810000C0593,,,,,,,,,,,,,0,,,,,VE,vergers,CIDRE,Cidre,1981,0.494378,48.192741
2021-1210474,2021-11-25,000001,Vente,152475,,,LE CLOTEAU,B755,72110,72281,Saint-Georges-du-Rosay,72,,,722810000C0595,,,,,,,,,,,,,0,,,,,P,prés,,,698,0.493777,48.192977
2021-1210474,2021-11-25,000001,Vente,152475,,,LA HAIZE,B478,72110,72281,Saint-Georges-du-Rosay,72,,,722810000C0642,,,,,,,,,,,,,0,,,,,S,sols,,,531,0.494106,48.192997
2021-1211251,2021-12-11,000001,Vente,190800,,,LA PROUTERIE,B706,72110,72281,Saint-Georges-du-Rosay,72,,,722810000B0262,,,,,,,,,,,,,0,,,,,S,sols,,,50,,
2021-1211251,2021-12-11,000001,Vente,190800,5282,,LA PROUTERIE,B706,72110,72281,Saint-Georges-du-Rosay,72,,,722810000B0468,,,,,,,,,,,,,0,1,Maison,35,2,S,sols,,,1337,0.529887,48.195945
2021-1211251,2021-12-11,000001,Vente,190800,5282,,LA PROUTERIE,B706,72110,72281,Saint-Georges-du-Rosay,72,,,722810000B0468,,,,,,,,,,,,,0,1,Maison,35,2,S,sols,,,1337,0.529887,48.195945
2021-1211251,2021-12-11,000001,Vente,190800,5282,,LA PROUTERIE,B706,72110,72281,Saint-Georges-du-Rosay,72,,,722810000B0468,,,,,,,,,,,,,0,1,Maison,35,2,S,sols,,,1337,0.529887,48.195945
2021-1211251,2021-12-11,000001,Vente,190800,,,LA PROUTERIE,B706,72110,72281,Saint-Georges-du-Rosay,72,,,722810000B0494,,,,,,,,,,,,,0,,,,,P,prés,,,1375,,
2021-1211251,2021-12-11,000001,Vente,190800,5160,,LA PROUTERIE,B706,72110,72281,Saint-Georges-du-Rosay,72,,,722810000B0496,,,,,,,,,,,,,0,1,Maison,140,4,S,sols,,,1722,,
2021-1211251,2021-12-11,000001,Vente,190800,5160,,LA PROUTERIE,B706,72110,72281,Saint-Georges-du-Rosay,72,,,722810000B0496,,,,,,,,,,,,,0,3,Dépendance,,0,S,sols,,,1722,,
2021-1211251,2021-12-11,000001,Vente,190800,,,LA PROUTERIE,B706,72110,72281,Saint-Georges-du-Rosay,72,,,722810000B0535,,,,,,,,,,,,,0,,,,,AG,terrains d'agrément,,,128,,
