id_mutation,date_mutation,numero_disposition,nature_mutation,valeur_fonciere,adresse_numero,adresse_suffixe,adresse_nom_voie,adresse_code_voie,code_postal,code_commune,nom_commune,code_departement,ancien_code_commune,ancien_nom_commune,id_parcelle,ancien_id_parcelle,numero_volume,lot1_numero,lot1_surface_carrez,lot2_numero,lot2_surface_carrez,lot3_numero,lot3_surface_carrez,lot4_numero,lot4_surface_carrez,lot5_numero,lot5_surface_carrez,nombre_lots,code_type_local,type_local,surface_reelle_bati,nombre_pieces_principales,code_nature_culture,nature_culture,code_nature_culture_speciale,nature_culture_speciale,surface_terrain,longitude,latitude
2021-1197136,2021-01-07,000001,Vente,403000,5892,,LA CARDINIERE,B033,72320,72373,Vibraye,72,,,72373000AO0082,,,,,,,,,,,,,0,1,Maison,200,6,AG,terrains d'agrément,,,3940,0.740338,48.048909
2021-1197136,2021-01-07,000001,Vente,403000,5892,,LA CARDINIERE,B033,72320,72373,Vibraye,72,,,72373000AO0082,,,,,,,,,,,,,0,1,Maison,200,6,P,prés,,,3461,0.740338,48.048909
2021-1197136,2021-01-07,000001,Vente,403000,5892,,LA CARDINIERE,B033,72320,72373,Vibraye,72,,,72373000AO0082,,,,,,,,,,,,,0,1,Maison,200,6,S,sols,,,130,0.740338,48.048909
2021-1197142,2021-01-12,000001,Vente,145000,7,,RUE ROGER COULON,0610,72320,72373,Vibraye,72,,,72373000AL0138,,,,,,,,,,,,,0,1,Maison,102,5,AG,terrains d'agrément,,,1500,0.729972,48.060828
2021-1197142,2021-01-12,000001,Vente,145000,7,,RUE ROGER COULON,0610,72320,72373,Vibraye,72,,,72373000AL0138,,,,,,,,,,,,,0,1,Maison,102,5,S,sols,,,1000,0.729972,48.060828
2021-1197182,2021-01-21,000001,Vente,228000,11,,RUE GABRIEL GOUSSAULT,0300,72320,72373,Vibraye,72,,,72373000AS0047,,,,,,,,,,,,,0,,,,,S,sols,,,95,0.735896,48.06013
2021-1197182,2021-01-21,000001,Vente,228000,13,,RUE GABRIEL GOUSSAULT,0300,72320,72373,Vibraye,72,,,72373000AS0048,,,,,,,,,,,,,0,1,Maison,160,5,S,sols,,,200,0.735891,48.060189
2021-1197182,2021-01-21,000001,Vente,228000,,,RUE XAVIER BOUTET,0760,72320,72373,Vibraye,72,,,72373000AS0605,,,,,,,,,,,,,0,,,,,S,sols,,,36,0.735734,48.060144
2021-1197187,2021-01-21,000001,Vente,165000,9,,RUE MALCOLM SMITH,0510,72320,72373,Vibraye,72,,,72373000AM0382,,,,,,,,,,,,,0,1,Maison,115,5,S,sols,,,696,0.73071,48.057299
2021-1197759,2021-01-30,000002,Vente,77000,5852,,LA GRANDE SOUDINIERE,B074,72320,72373,Vibraye,72,,,72373000BP0057,,,,,,,,,,,,,0,1,Maison,87,3,,,,,,0.770156,48.029956
2021-1198035,2021-01-25,000001,Vente,110000,26,,RTE DE LA BRUYERE,0080,72320,72373,Vibraye,72,,,72373000AN0104,,,,,,,,,,,,,0,1,Maison,86,4,J,jardins,,,363,0.733143,48.05039
2021-1198035,2021-01-25,000001,Vente,110000,26,,RTE DE LA BRUYERE,0080,72320,72373,Vibraye,72,,,72373000AN0104,,,,,,,,,,,,,0,1,Maison,86,4,S,sols,,,637,0.733143,48.05039
2021-1198035,2021-01-25,000001,Vente,110000,,,RTE DE LA BRUYERE,0080,72320,72373,Vibraye,72,,,72373000AN0119,,,,,,,,,,,,,0,,,,,S,sols,,,45,0.732816,48.050563
2021-1198035,2021-01-25,000001,Vente,110000,,,RTE DE LA BRUYERE,0080,72320,72373,Vibraye,72,,,72373000AN0119,,,,,,,,,,,,,0,,,,,J,jardins,,,445,0.732816,48.050563
2021-1198131,2021-02-01,000001,Vente,170000,40,B,RTE DE LA FERTE BERNARD,0280,72320,72373,Vibraye,72,,,72373000AV0004,,,,,,,,,,,,,0,1,Maison,91,5,S,sols,,,411,0.731364,48.069801
2021-1198131,2021-02-01,000001,Vente,170000,40,B,RTE DE LA FERTE BERNARD,0280,72320,72373,Vibraye,72,,,72373000AV0004,,,,,,,,,,,,,0,1,Maison,91,5,J,jardins,,,785,0.731364,48.069801
2021-1198147,2021-02-01,000001,Vente,23000,,,RTE DE MELLERAY,0520,72320,72373,Vibraye,72,,,72373000AS0791,,,,,,,,,,,,,0,,,,,S,sols,,,150,0.742899,48.06125
2021-1198147,2021-02-01,000001,Vente,23000,,,RTE DE MELLERAY,0520,72320,72373,Vibraye,72,,,72373000AS0792,,,,,,,,,,,,,0,,,,,P,prés,,,931,0.743245,48.06111
2021-1198398,2021-02-12,000001,Vente,20000,,,,,,72373,Vibraye,72,,,72373000AS0465,,2,,,,,,,,,,,0,,,,,,,,,,0.735757,48.059315
2021-1198785,2021-03-09,000001,Vente,5000,16,,RUE DU VAL DE BRAYE,0753,72320,72373,Vibraye,72,,,72373000AR0028,,,,,,,,,,,,,0,3,Dépendance,,0,S,sols,,,51,0.74036,48.056799
2021-1198998,2021-03-12,000001,Vente,180000,26,,RUE DES SABLONS,0660,72320,72373,Vibraye,72,,,72373000AS0418,,,,,,,,,,,,,0,3,Dépendance,,0,S,sols,,,418,0.735867,48.058511
2021-1198998,2021-03-12,000001,Vente,180000,26,,RUE DES SABLONS,0660,72320,72373,Vibraye,72,,,72373000AS0418,,,,,,,,,,,,,0,3,Dépendance,,0,S,sols,,,418,0.735867,48.058511
2021-1198998,2021-03-12,000001,Vente,180000,26,,RUE DES SABLONS,0660,72320,72373,Vibraye,72,,,72373000AS0418,,,,,,,,,,,,,0,1,Maison,96,5,S,sols,,,418,0.735867,48.058511
2021-1199451,2021-03-10,000001,Vente,96000,23,,RUE DE SAINTE ANNE,0720,72320,72373,Vibraye,72,,,72373000AM0203,,,,,,,,,,,,,0,1,Maison,63,4,S,sols,,,404,0.733264,48.054817
2021-1199453,2021-03-12,000001,Vente,95000,6,,RTE DE MELLERAY,0520,72320,72373,Vibraye,72,,,72373000AS0260,,,,,,,,,,,,,0,1,Maison,86,4,J,jardins,,,1527,0.743324,48.060766
2021-1199453,2021-03-12,000001,Vente,95000,6,,RTE DE MELLERAY,0520,72320,72373,Vibraye,72,,,72373000AS0260,,,,,,,,,,,,,0,1,Maison,86,4,S,sols,,,434,0.743324,48.060766
2021-1199616,2021-03-26,000001,Vente,90000,5827,,LE GUE DE LAUNAY EST,B254,72320,72373,Vibraye,72,,,72373000BN0062,,,,,,,,,,,,,0,1,Maison,52,2,T,terres,,,1451,0.776014,48.038041
2021-1199616,2021-03-26,000001,Vente,90000,5827,,LE GUE DE LAUNAY EST,B254,72320,72373,Vibraye,72,,,72373000BN0062,,,,,,,,,,,,,0,1,Maison,52,2,S,sols,,,273,0.776014,48.038041
2021-1199616,2021-03-26,000001,Vente,90000,5826,,LE GUE DE LAUNAY EST,B254,72320,72373,Vibraye,72,,,72373000BN0082,,,,,,,,,,,,,0,1,Maison,50,2,S,sols,,,84,0.775696,48.038045
2021-1199616,2021-03-26,000001,Vente,90000,5826,,LE GUE DE LAUNAY EST,B254,72320,72373,Vibraye,72,,,72373000BN0082,,,,,,,,,,,,,0,3,Dépendance,,0,S,sols,,,84,0.775696,48.038045
2021-1199647,2021-03-29,000002,Vente,36706,,,LA BRAYE,B025,72320,72373,Vibraye,72,,,72373000AL0349,,,,,,,,,,,,,0,,,,,P,prés,,,36706,0.724037,48.061788
2021-1199648,2021-03-29,000001,Vente,12000,132,,RUE DES SABLONS,0660,72320,72373,Vibraye,72,,,72373000AM0238,,,,,,,,,,,,,0,1,Maison,24,1,S,sols,,,36,0.735859,48.054649
2021-1199648,2021-03-29,000001,Vente,12000,132,,RUE DES SABLONS,0660,72320,72373,Vibraye,72,,,72373000AM0242,,,,,,,,,,,,,0,,,,,S,sols,,,219,0.735965,48.054537
2021-1200105,2021-04-02,000001,Vente,50000,18,,RUE DE SAINTE ANNE,0720,72320,72373,Vibraye,72,,,72373000AM0172,,,,,,,,,,,,,0,1,Maison,44,2,S,sols,,,392,0.73462,48.055675
2021-1200151,2021-03-31,000001,Vente,282940,27,,RUE DE LA RIVIERE,0600,72320,72373,Vibraye,72,,,72373000AS0797,,,,,,,,,,,,,0,2,Appartement,20,1,S,sols,,,1088,0.736974,48.059703
2021-1200151,2021-03-31,000001,Vente,282940,27,,RUE DE LA RIVIERE,0600,72320,72373,Vibraye,72,,,72373000AS0797,,,,,,,,,,,,,0,2,Appartement,46,2,S,sols,,,1088,0.736974,48.059703
2021-1200151,2021-03-31,000001,Vente,282940,27,,RUE DE LA RIVIERE,0600,72320,72373,Vibraye,72,,,72373000AS0797,,,,,,,,,,,,,0,2,Appartement,47,2,S,sols,,,1088,0.736974,48.059703
2021-1200151,2021-03-31,000001,Vente,282940,27,,RUE DE LA RIVIERE,0600,72320,72373,Vibraye,72,,,72373000AS0797,,,,,,,,,,,,,0,2,Appartement,27,1,S,sols,,,1088,0.736974,48.059703
2021-1200151,2021-03-31,000001,Vente,282940,27,,RUE DE LA RIVIERE,0600,72320,72373,Vibraye,72,,,72373000AS0797,,,,,,,,,,,,,0,2,Appartement,27,2,S,sols,,,1088,0.736974,48.059703
2021-1200151,2021-03-31,000001,Vente,282940,27,,RUE DE LA RIVIERE,0600,72320,72373,Vibraye,72,,,72373000AS0797,,,,,,,,,,,,,0,2,Appartement,41,3,S,sols,,,1088,0.736974,48.059703
2021-1200151,2021-03-31,000001,Vente,282940,27,,RUE DE LA RIVIERE,0600,72320,72373,Vibraye,72,,,72373000AS0797,,,,,,,,,,,,,0,2,Appartement,27,2,S,sols,,,1088,0.736974,48.059703
2021-1200151,2021-03-31,000001,Vente,282940,27,,RUE DE LA RIVIERE,0600,72320,72373,Vibraye,72,,,72373000AS0797,,,,,,,,,,,,,0,2,Appartement,20,1,S,sols,,,1088,0.736974,48.059703
2021-1200151,2021-03-31,000001,Vente,282940,27,,RUE DE LA RIVIERE,0600,72320,72373,Vibraye,72,,,72373000AS0797,,,,,,,,,,,,,0,2,Appartement,41,2,S,sols,,,1088,0.736974,48.059703
2021-1200151,2021-03-31,000001,Vente,282940,27,,RUE DE LA RIVIERE,0600,72320,72373,Vibraye,72,,,72373000AS0797,,,,,,,,,,,,,0,3,Dépendance,,0,S,sols,,,1088,0.736974,48.059703
2021-1200151,2021-03-31,000001,Vente,282940,27,,RUE DE LA RIVIERE,0600,72320,72373,Vibraye,72,,,72373000AS0797,,,,,,,,,,,,,0,3,Dépendance,,0,S,sols,,,1088,0.736974,48.059703
2021-1200151,2021-03-31,000001,Vente,282940,27,,RUE DE LA RIVIERE,0600,72320,72373,Vibraye,72,,,72373000AS0797,,,,,,,,,,,,,0,2,Appartement,22,2,S,sols,,,1088,0.736974,48.059703
2021-1200151,2021-03-31,000001,Vente,282940,27,,RUE DE LA RIVIERE,0600,72320,72373,Vibraye,72,,,72373000AS0797,,,,,,,,,,,,,0,1,Maison,32,2,S,sols,,,1088,0.736974,48.059703
2021-1200151,2021-03-31,000001,Vente,282940,27,,RUE DE LA RIVIERE,0600,72320,72373,Vibraye,72,,,72373000AS0797,,,,,,,,,,,,,0,1,Maison,51,3,S,sols,,,1088,0.736974,48.059703
2021-1200151,2021-03-31,000001,Vente,282940,27,,RUE DE LA RIVIERE,0600,72320,72373,Vibraye,72,,,72373000AS0797,,,,,,,,,,,,,0,2,Appartement,28,2,S,sols,,,1088,0.736974,48.059703
2021-1200151,2021-03-31,000001,Vente,282940,27,,RUE DE LA RIVIERE,0600,72320,72373,Vibraye,72,,,72373000AS0797,,,,,,,,,,,,,0,2,Appartement,55,3,S,sols,,,1088,0.736974,48.059703
2021-1200151,2021-03-31,000001,Vente,282940,27,,RUE DE LA RIVIERE,0600,72320,72373,Vibraye,72,,,72373000AS0797,,,,,,,,,,,,,0,2,Appartement,45,2,S,sols,,,1088,0.736974,48.059703
2021-1200151,2021-03-31,000001,Vente,282940,27,,RUE DE LA RIVIERE,0600,72320,72373,Vibraye,72,,,72373000AS0797,,,,,,,,,,,,,0,2,Appartement,55,3,S,sols,,,1088,0.736974,48.059703
2021-1200151,2021-03-31,000001,Vente,282940,27,,RUE DE LA RIVIERE,0600,72320,72373,Vibraye,72,,,72373000AS0797,,,,,,,,,,,,,0,3,Dépendance,,0,S,sols,,,1088,0.736974,48.059703
2021-1200151,2021-03-31,000001,Vente,282940,27,,RUE DE LA RIVIERE,0600,72320,72373,Vibraye,72,,,72373000AS0797,,,,,,,,,,,,,0,3,Dépendance,,0,S,sols,,,1088,0.736974,48.059703
2021-1200151,2021-03-31,000001,Vente,282940,27,,RUE DE LA RIVIERE,0600,72320,72373,Vibraye,72,,,72373000AS0797,,,,,,,,,,,,,0,3,Dépendance,,0,S,sols,,,1088,0.736974,48.059703
2021-1200151,2021-03-31,000001,Vente,282940,27,,RUE DE LA RIVIERE,0600,72320,72373,Vibraye,72,,,72373000AS0797,,,,,,,,,,,,,0,3,Dépendance,,0,S,sols,,,1088,0.736974,48.059703
2021-1200151,2021-03-31,000001,Vente,282940,27,,RUE DE LA RIVIERE,0600,72320,72373,Vibraye,72,,,72373000AS0797,,,,,,,,,,,,,0,3,Dépendance,,0,S,sols,,,1088,0.736974,48.059703
2021-1200151,2021-03-31,000001,Vente,282940,27,,RUE DE LA RIVIERE,0600,72320,72373,Vibraye,72,,,72373000AS0797,,,,,,,,,,,,,0,3,Dépendance,,0,S,sols,,,1088,0.736974,48.059703
2021-1200151,2021-03-31,000001,Vente,282940,27,,RUE DE LA RIVIERE,0600,72320,72373,Vibraye,72,,,72373000AS0797,,,,,,,,,,,,,0,3,Dépendance,,0,S,sols,,,1088,0.736974,48.059703
2021-1200151,2021-03-31,000001,Vente,282940,27,,RUE DE LA RIVIERE,0600,72320,72373,Vibraye,72,,,72373000AS0797,,,,,,,,,,,,,0,3,Dépendance,,0,S,sols,,,1088,0.736974,48.059703
2021-1200184,2021-04-07,000001,Vente,54000,14,,RUE DE LA RIVIERE,0600,72320,72373,Vibraye,72,,,72373000AS0327,,,,,,,,,,,,,0,,,,,J,jardins,,,76,0.737337,48.058411
2021-1200184,2021-04-07,000001,Vente,54000,14,,RUE DE LA RIVIERE,0600,72320,72373,Vibraye,72,,,72373000AS0328,,,,,,,,,,,,,0,,,,,J,jardins,,,88,0.737337,48.058486
2021-1200184,2021-04-07,000001,Vente,54000,14,,RUE DE LA RIVIERE,0600,72320,72373,Vibraye,72,,,72373000AS0329,,,,,,,,,,,,,0,,,,,J,jardins,,,77,0.737337,48.05858
2021-1200184,2021-04-07,000001,Vente,54000,14,,RUE DE LA RIVIERE,0600,72320,72373,Vibraye,72,,,72373000AS0330,,,,,,,,,,,,,0,,,,,J,jardins,,,86,0.737344,48.058695
2021-1200184,2021-04-07,000001,Vente,54000,14,,RUE DE LA RIVIERE,0600,72320,72373,Vibraye,72,,,72373000AS0331,,,,,,,,,,,,,0,,,,,J,jardins,,,72,0.737337,48.058778
2021-1200184,2021-04-07,000001,Vente,54000,14,,RUE DE LA RIVIERE,0600,72320,72373,Vibraye,72,,,72373000AS0332,,,,,,,,,,,,,0,,,,,J,jardins,,,86,0.73732,48.05888
2021-1200184,2021-04-07,000001,Vente,54000,16,,RUE DE LA RIVIERE,0600,72320,72373,Vibraye,72,,,72373000AS0333,,,,,,,,,,,,,0,1,Maison,159,6,S,sols,,,540,0.737286,48.058886
2021-1200184,2021-04-07,000001,Vente,54000,16,,RUE DE LA RIVIERE,0600,72320,72373,Vibraye,72,,,72373000AS0333,,,,,,,,,,,,,0,1,Maison,53,3,S,sols,,,540,0.737286,48.058886
2021-1200184,2021-04-07,000001,Vente,54000,16,,RUE DE LA RIVIERE,0600,72320,72373,Vibraye,72,,,72373000AS0334,,,,,,,,,,,,,0,,,,,S,sols,,,67,0.737295,48.059238
2021-1200791,2021-04-16,000001,Vente,135000,15,,RUE CAROLINE AIGLE,0230,72320,72373,Vibraye,72,,,72373000AW0089,,,,,,,,,,,,,0,1,Maison,86,3,S,sols,,,707,0.745648,48.064149
2021-1200831,2021-04-21,000001,Vente,140000,21,,RUE XAVIER BOUTET,0760,72320,72373,Vibraye,72,,,72373000AS0448,,,,,,,,,,,,,0,3,Dépendance,,0,S,sols,,,215,0.734639,48.05953
2021-1200831,2021-04-21,000001,Vente,140000,21,,RUE XAVIER BOUTET,0760,72320,72373,Vibraye,72,,,72373000AS0448,,,,,,,,,,,,,0,3,Dépendance,,0,S,sols,,,215,0.734639,48.05953
2021-1200831,2021-04-21,000001,Vente,140000,21,,RUE XAVIER BOUTET,0760,72320,72373,Vibraye,72,,,72373000AS0448,,,,,,,,,,,,,0,1,Maison,112,4,S,sols,,,215,0.734639,48.05953
2021-1200831,2021-04-21,000001,Vente,140000,21,,RUE XAVIER BOUTET,0760,72320,72373,Vibraye,72,,,72373000AS0448,,,,,,,,,,,,,0,4,Local industriel. commercial ou assimilé,130,0,S,sols,,,215,0.734639,48.05953
2021-1200831,2021-04-21,000001,Vente,140000,25,,RUE XAVIER BOUTET,0760,72320,72373,Vibraye,72,,,72373000AS0450,,,,,,,,,,,,,0,,,,,S,sols,,,160,0.734556,48.059509
2021-1200831,2021-04-21,000001,Vente,140000,23,,RUE XAVIER BOUTET,0760,72320,72373,Vibraye,72,,,72373000AS0452,,,,,,,,,,,,,0,,,,,S,sols,,,3,0.734625,48.05944
2021-1200831,2021-04-21,000001,Vente,140000,23,,RUE XAVIER BOUTET,0760,72320,72373,Vibraye,72,,,72373000AS0610,,,,,,,,,,,,,0,,,,,S,sols,,,18,0.73458,48.059515
2021-1201246,2021-04-26,000001,Vente,90000,60,,RUE DES SABLONS,0660,72320,72373,Vibraye,72,,,72373000AM0140,,,,,,,,,,,,,0,3,Dépendance,,0,S,sols,,,148,0.735585,48.05732
2021-1201246,2021-04-26,000001,Vente,90000,60,,RUE DES SABLONS,0660,72320,72373,Vibraye,72,,,72373000AM0140,,,,,,,,,,,,,0,1,Maison,75,3,J,jardins,,,578,0.735585,48.05732
2021-1201246,2021-04-26,000001,Vente,90000,60,,RUE DES SABLONS,0660,72320,72373,Vibraye,72,,,72373000AM0140,,,,,,,,,,,,,0,3,Dépendance,,0,S,sols,,,148,0.735585,48.05732
2021-1201246,2021-04-26,000001,Vente,90000,60,,RUE DES SABLONS,0660,72320,72373,Vibraye,72,,,72373000AM0140,,,,,,,,,,,,,0,3,Dépendance,,0,J,jardins,,,578,0.735585,48.05732
2021-1201246,2021-04-26,000001,Vente,90000,60,,RUE DES SABLONS,0660,72320,72373,Vibraye,72,,,72373000AM0140,,,,,,,,,,,,,0,3,Dépendance,,0,J,jardins,,,578,0.735585,48.05732
2021-1201246,2021-04-26,000001,Vente,90000,60,,RUE DES SABLONS,0660,72320,72373,Vibraye,72,,,72373000AM0140,,,,,,,,,,,,,0,1,Maison,75,3,S,sols,,,148,0.735585,48.05732
2021-1201277,2021-04-27,000001,Vente,20368.24,3,,RUE HELENE BOUCHER,0585,72320,72373,Vibraye,72,,,72373000AW0103,,,,,,,,,,,,,0,,,,,AB,terrains a bâtir,,,677,0.744999,48.062602
2021-1201564,2021-04-27,000001,Vente,24490.02,10,,RUE HELENE BOUCHER,0585,72320,72373,Vibraye,72,,,72373000AW0113,,,,,,,,,,,,,0,,,,,AB,terrains a bâtir,,,814,0.745596,48.063296
2021-1201849,2021-05-05,000001,Vente,146000,72,,RUE XAVIER BOUTET,0760,72320,72373,Vibraye,72,,,72373000AL0025,,,,,,,,,,,,,0,1,Maison,120,6,S,sols,,,587,0.730826,48.059913
2021-1202034,2021-05-10,000001,Vente,15000,,,RUE DES SABLONS,0660,72320,72373,Vibraye,72,,,72373000AM0227,,,,,,,,,,,,,0,,,,,J,jardins,,,68,0.735916,48.055326
2021-1202034,2021-05-10,000001,Vente,15000,115,,RUE DES SABLONS,0660,72320,72373,Vibraye,72,,,72373000AR0070,,,,,,,,,,,,,0,1,Maison,31,1,S,sols,,,63,0.736384,48.055542
2021-1202096,2021-05-12,000001,Vente,25532.5,,,BEURREROUX,B174,72320,72373,Vibraye,72,,,72373000AC0005,,,,,,,,,,,,,0,,,,,T,terres,,,20430,0.699005,48.06946
2021-1202103,2021-05-12,000001,Vente,165000,6,,RUE MOZART,0542,72320,72373,Vibraye,72,,,72373000AV0273,,,,,,,,,,,,,0,1,Maison,105,5,S,sols,,,684,0.730425,48.06838
2021-1202394,2021-06-01,000001,Vente,128000,4,,SQ JACQUELINE AURIOL,0592,72320,72373,Vibraye,72,,,72373000AW0094,,,,,,,,,,,,,0,3,Dépendance,,0,AB,terrains a bâtir,,,807,0.74537,48.061804
2021-1202394,2021-06-01,000001,Vente,128000,4,,SQ JACQUELINE AURIOL,0592,72320,72373,Vibraye,72,,,72373000AW0094,,,,,,,,,,,,,0,1,Maison,87,3,AB,terrains a bâtir,,,807,0.74537,48.061804
2021-1202903,2021-06-15,000001,Vente,66000,3,,CITE JEAN JAURES,A015,72320,72373,Vibraye,72,,,72373000AV0126,,,,,,,,,,,,,0,1,Maison,88,4,S,sols,,,728,0.732135,48.06969
2021-1203235,2021-06-24,000001,Vente,140000,4,,SQ LEO DELIBES,0490,72320,72373,Vibraye,72,,,72373000AV0271,,,,,,,,,,,,,0,1,Maison,86,3,AG,terrains d'agrément,,,662,0.730293,48.068683
2021-1203255,2021-06-17,000001,Vente,90000,75,,RUE GABRIEL GOUSSAULT,0300,72320,72373,Vibraye,72,,,72373000AT0141,,,,,,,,,,,,,0,1,Maison,127,4,S,sols,,,389,0.73407,48.063145
2021-1203255,2021-06-17,000001,Vente,90000,75,,RUE GABRIEL GOUSSAULT,0300,72320,72373,Vibraye,72,,,72373000AT0141,,,,,,,,,,,,,0,1,Maison,127,4,J,jardins,,,630,0.73407,48.063145
2021-1203625,2021-06-28,000001,Vente,50000,,,RUE DES SABLONS,0660,72320,72373,Vibraye,72,,,72373000AM0280,,,,,,,,,,,,,0,,,,,S,sols,,,46,0.735736,48.055175
2021-1203625,2021-06-28,000001,Vente,50000,5358,,RUE DES SABLONS,0660,72320,72373,Vibraye,72,,,72373000AM0281,,,,,,,,,,,,,0,1,Maison,70,3,J,jardins,,,636,0.735699,48.055006
2021-1203625,2021-06-28,000001,Vente,50000,5358,,RUE DES SABLONS,0660,72320,72373,Vibraye,72,,,72373000AM0281,,,,,,,,,,,,,0,1,Maison,70,3,S,sols,,,260,0.735699,48.055006
2021-1203669,2021-06-29,000001,Vente,135000,29,,RTE DE LA BRUYERE,0080,72320,72373,Vibraye,72,,,72373000AO0016,,,,,,,,,,,,,0,1,Maison,90,3,J,jardins,,,773,0.732591,48.049419
2021-1203669,2021-06-29,000001,Vente,135000,29,,RTE DE LA BRUYERE,0080,72320,72373,Vibraye,72,,,72373000AO0016,,,,,,,,,,,,,0,1,Maison,90,3,S,sols,,,732,0.732591,48.049419
2021-1203677,2021-06-29,000001,Vente,70000,56,,RUE DE SAINTE ANNE,0720,72320,72373,Vibraye,72,,,72373000AM0274,,,,,,,,,,,,,0,1,Maison,58,3,S,sols,,,473,0.731851,48.054736
2021-1203677,2021-06-29,000001,Vente,70000,,,RUE DE SAINTE ANNE,0720,72320,72373,Vibraye,72,,,72373000AM0275,,,,,,,,,,,,,0,,,,,S,sols,,,11,,
2021-1203682,2021-06-29,000001,Vente,1,,,RUE DE SAINTE ANNE,0720,72320,72373,Vibraye,72,,,72373000AM0275,,,,,,,,,,,,,0,,,,,S,sols,,,11,,
2021-1203861,2021-07-03,000001,Vente,110000,15,,RUE TELEMANN,0752,72320,72373,Vibraye,72,,,72373000AV0196,,,,,,,,,,,,,0,1,Maison,66,3,S,sols,,,450,0.731008,48.067657
2021-1204103,2021-07-03,000001,Vente,100000,20,,RTE DE LA FERTE BERNARD,0280,72320,72373,Vibraye,72,,,72373000AV0042,,,,,,,,,,,,,0,1,Maison,75,3,J,jardins,,,536,0.732542,48.067623
2021-1204103,2021-07-03,000001,Vente,100000,20,,RTE DE LA FERTE BERNARD,0280,72320,72373,Vibraye,72,,,72373000AV0042,,,,,,,,,,,,,0,1,Maison,75,3,S,sols,,,301,0.732542,48.067623
2021-1204578,2021-07-16,000001,Vente,136000,1,,RUE DES CAPUCINES,0120,72320,72373,Vibraye,72,,,72373000AM0059,,,,,,,,,,,,,0,1,Maison,66,4,S,sols,,,405,0.731966,48.058401
2021-1204578,2021-07-16,000001,Vente,136000,1,,RUE DES CAPUCINES,0120,72320,72373,Vibraye,72,,,72373000AM0059,,,,,,,,,,,,,0,3,Dépendance,,0,S,sols,,,405,0.731966,48.058401
2021-1204582,2021-07-16,000001,Vente,190000,128,,RUE DES SABLONS,0660,72320,72373,Vibraye,72,,,72373000AM0234,,,,,,,,,,,,,0,1,Maison,160,3,J,jardins,,,451,0.736084,48.055033
2021-1204582,2021-07-16,000001,Vente,190000,128,,RUE DES SABLONS,0660,72320,72373,Vibraye,72,,,72373000AM0234,,,,,,,,,,,,,0,1,Maison,160,3,S,sols,,,213,0.736084,48.055033
2021-1204590,2021-07-16,000001,Vente,139000,12,,PL SAINT LOUIS,0740,72320,72373,Vibraye,72,,,72373000AS0295,,,,,,,,,,,,,0,3,Dépendance,,0,S,sols,,,139,0.740071,48.058447
2021-1204590,2021-07-16,000001,Vente,139000,12,,PL SAINT LOUIS,0740,72320,72373,Vibraye,72,,,72373000AS0295,,,,,,,,,,,,,0,1,Maison,120,4,S,sols,,,139,0.740071,48.058447
2021-1204590,2021-07-16,000001,Vente,139000,10,,PL SAINT LOUIS,0740,72320,72373,Vibraye,72,,,72373000AS0296,,,,,,,,,,,,,0,,,,,S,sols,,,166,0.739967,48.058472
2021-1205782,2021-07-27,000001,Vente,185000,13,,RUE ALBERT LORY,0030,72320,72373,Vibraye,72,,,72373000AV0302,,,,,,,,,,,,,0,1,Maison,132,5,S,sols,,,1009,0.730053,48.067034
2021-1205783,2021-07-20,000001,Vente,162500,22,,RUE MALCOLM SMITH,0510,72320,72373,Vibraye,72,,,72373000AM0406,,,,,,,,,,,,,0,1,Maison,102,6,S,sols,,,788,0.729613,48.056572
2021-1206232,2021-08-02,000002,Vente,100,,,LE PETIT PERRE,B303,72320,72373,Vibraye,72,,,72373000BL0084,,,,,,,,,,,,,0,,,,,T,terres,,,418,0.763359,48.046246
2021-1206262,2021-07-28,000001,Vente,81000,5843,,LE GUE DE LAUNAY EST,B254,72320,72373,Vibraye,72,,,72373000BN0007,,,,,,,,,,,,,0,1,Maison,68,2,S,sols,,,465,0.774785,48.037222
2021-1206648,2021-09-02,000001,Vente,310000,6321,,AV MICHEL VERDIER,0540,72320,72373,Vibraye,72,,,72373000AL0292,,,,,,,,,,,,,0,4,Local industriel. commercial ou assimilé,708,0,P,prés,,,1239,0.72756,48.063762
2021-1206648,2021-09-02,000001,Vente,310000,6321,,AV MICHEL VERDIER,0540,72320,72373,Vibraye,72,,,72373000AL0292,,,,,,,,,,,,,0,4,Local industriel. commercial ou assimilé,708,0,S,sols,,,3037,0.72756,48.063762
2021-1208166,2021-10-06,000001,Vente,15000,,,LE GUE DE LAUNAY EST,B254,72320,72373,Vibraye,72,,,72373000BN0025,,,,,,,,,,,,,0,,,,,P,prés,,,5506,0.776498,48.038621
2021-1208166,2021-10-06,000001,Vente,15000,,,LE GUE DE LAUNAY EST,B254,72320,72373,Vibraye,72,,,72373000BN0025,,,,,,,,,,,,,0,,,,,S,sols,,,187,0.776498,48.038621
2021-1208166,2021-10-06,000001,Vente,15000,,,LE GUE DE LAUNAY EST,B254,72320,72373,Vibraye,72,,,72373000BN0025,,,,,,,,,,,,,0,,,,,E,eaux,ETANG,Etangs,1094,0.776498,48.038621
2021-1208181,2021-09-28,000001,Vente,95000,5757,,TIVOLI,B154,72320,72373,Vibraye,72,,,72373000AZ0025,,,,,,,,,,,,,0,1,Maison,65,3,S,sols,,,1890,0.775304,48.058005
2021-1208668,2021-10-04,000001,Vente,19706.34,1,,RUE HELENE BOUCHER,0585,72320,72373,Vibraye,72,,,72373000AW0102,,,,,,,,,,,,,0,,,,,AB,terrains a bâtir,,,655,0.744951,48.062392
2021-1208684,2021-10-12,000001,Vente,62000,114,,RUE DES SABLONS,0660,72320,72373,Vibraye,72,,,72373000AM0223,,,,,,,,,,,,,0,1,Maison,76,6,S,sols,,,212,0.735801,48.055602
2021-1208684,2021-10-12,000001,Vente,62000,114,,RUE DES SABLONS,0660,72320,72373,Vibraye,72,,,72373000AM0223,,,,,,,,,,,,,0,3,Dépendance,,0,S,sols,,,212,0.735801,48.055602
2021-1208684,2021-10-12,000001,Vente,62000,114,,RUE DES SABLONS,0660,72320,72373,Vibraye,72,,,72373000AM0223,,,,,,,,,,,,,0,3,Dépendance,,0,S,sols,,,212,0.735801,48.055602
2021-1208685,2021-10-11,000001,Vente,175000,5499,B,RLE DES EPINARDS,0240,72320,72373,Vibraye,72,,,72373000AM0322,,,,,,,,,,,,,0,3,Dépendance,,0,S,sols,,,628,0.733922,48.058081
2021-1208685,2021-10-11,000001,Vente,175000,5499,B,RLE DES EPINARDS,0240,72320,72373,Vibraye,72,,,72373000AM0322,,,,,,,,,,,,,0,3,Dépendance,,0,P,prés,,,1176,0.733922,48.058081
2021-1208685,2021-10-11,000001,Vente,175000,5499,B,RLE DES EPINARDS,0240,72320,72373,Vibraye,72,,,72373000AM0322,,,,,,,,,,,,,0,1,Maison,85,3,P,prés,,,1176,0.733922,48.058081
2021-1208685,2021-10-11,000001,Vente,175000,5499,B,RLE DES EPINARDS,0240,72320,72373,Vibraye,72,,,72373000AM0322,,,,,,,,,,,,,0,1,Maison,85,3,S,sols,,,628,0.733922,48.058081
2021-1208856,2021-09-29,000001,Vente,80000,12,,CHE DE VILLEMAIGRE,0756,72320,72373,Vibraye,72,,,72373000AO0086,,,,,,,,,,,,,0,3,Dépendance,,0,S,sols,,,525,0.731876,48.048012
2021-1208856,2021-09-29,000001,Vente,80000,12,,CHE DE VILLEMAIGRE,0756,72320,72373,Vibraye,72,,,72373000AO0086,,,,,,,,,,,,,0,1,Maison,190,5,S,sols,,,525,0.731876,48.048012
2021-1208856,2021-09-29,000001,Vente,80000,12,,CHE DE VILLEMAIGRE,0756,72320,72373,Vibraye,72,,,72373000AO0086,,,,,,,,,,,,,0,1,Maison,190,5,J,jardins,,,965,0.731876,48.048012
2021-1208856,2021-09-29,000001,Vente,80000,12,,CHE DE VILLEMAIGRE,0756,72320,72373,Vibraye,72,,,72373000AO0086,,,,,,,,,,,,,0,3,Dépendance,,0,J,jardins,,,965,0.731876,48.048012