id_mutation,date_mutation,numero_disposition,nature_mutation,valeur_fonciere,adresse_numero,adresse_suffixe,adresse_nom_voie,adresse_code_voie,code_postal,code_commune,nom_commune,code_departement,ancien_code_commune,ancien_nom_commune,id_parcelle,ancien_id_parcelle,numero_volume,lot1_numero,lot1_surface_carrez,lot2_numero,lot2_surface_carrez,lot3_numero,lot3_surface_carrez,lot4_numero,lot4_surface_carrez,lot5_numero,lot5_surface_carrez,nombre_lots,code_type_local,type_local,surface_reelle_bati,nombre_pieces_principales,code_nature_culture,nature_culture,code_nature_culture_speciale,nature_culture_speciale,surface_terrain,longitude,latitude
2021-1212919,2021-01-18,000002,Vente,348000,,,SAINT JOSEPH,B100,73800,73089,Coise-Saint-Jean-Pied-Gauthier,73,,,730890000E1333,,,,,,,,,,,,,0,,,,,P,prés,,,1295,6.108301,45.505128
2021-1212919,2021-01-18,000002,Vente,348000,1629,,RTE DU MONNET,1370,73800,73089,Coise-Saint-Jean-Pied-Gauthier,73,,,730890000E1335,,,,,,,,,,,,,0,1,Maison,101,4,,,,,,6.108453,45.505422
2021-1212919,2021-01-18,000002,Vente,348000,,,SAINT JOSEPH,B100,73800,73089,Coise-Saint-Jean-Pied-Gauthier,73,,,730890000E1337,,,,,,,,,,,,,0,,,,,T,terres,,,478,6.108862,45.505451
2021-1214429,2021-02-26,000001,Vente,99000,,,LE BACHAT,B001,73800,73089,Coise-Saint-Jean-Pied-Gauthier,73,,,730890000C1540,,,,,,,,,,,,,0,,,,,AB,terrains a bâtir,,,808,6.143667,45.528341
2021-1214514,2021-02-11,000001,Vente,130000,,,A CHAUSSEE,B015,73800,73089,Coise-Saint-Jean-Pied-Gauthier,73,,,730890000B0489,,,,,,,,,,,,,0,,,,,VI,vignes,,,1615,6.155295,45.537797
2021-1214514,2021-02-11,000001,Vente,130000,,,A CHAUSSEE,B015,73800,73089,Coise-Saint-Jean-Pied-Gauthier,73,,,730890000B0490,,,,,,,,,,,,,0,,,,,T,terres,,,1675,6.155434,45.53786
2021-1214729,2021-03-05,000002,Vente,194850,,,LE BACHAT,B001,73800,73089,Coise-Saint-Jean-Pied-Gauthier,73,,,730890000C1526,,,,,,,,,,,,,0,,,,,P,prés,,,12,6.143471,45.528514
2021-1214729,2021-03-05,000002,Vente,194850,,,LE BACHAT,B001,73800,73089,Coise-Saint-Jean-Pied-Gauthier,73,,,730890000C1528,,,,,,,,,,,,,0,,,,,S,sols,,,300,6.143505,45.528429
2021-1215296,2021-03-17,000001,Vente,129000,,,LES FRASSES,B039,73800,73089,Coise-Saint-Jean-Pied-Gauthier,73,,,730890000C0176,,,,,,,,,,,,,0,,,,,P,prés,,,665,6.135457,45.531295
2021-1215296,2021-03-17,000001,Vente,129000,906,,RTE DES FRASSES,0850,73800,73089,Coise-Saint-Jean-Pied-Gauthier,73,,,730890000C0177,,,,,,,,,,,,,0,1,Maison,60,3,S,sols,,,320,6.135554,45.531152
2021-1215296,2021-03-17,000001,Vente,129000,906,,RTE DES FRASSES,0850,73800,73089,Coise-Saint-Jean-Pied-Gauthier,73,,,730890000C0177,,,,,,,,,,,,,0,3,Dépendance,,0,S,sols,,,320,6.135554,45.531152
2021-1215908,2021-03-23,000002,Vente,1260,,,LES GRANDS CHAMPS,B049,73800,73089,Coise-Saint-Jean-Pied-Gauthier,73,,,730890000B1481,,,,,,,,,,,,,0,,,,,S,sols,,,42,6.150807,45.529204
2021-1215910,2021-03-23,000002,Vente,1320,,,LES GRANDS CHAMPS,B049,73800,73089,Coise-Saint-Jean-Pied-Gauthier,73,,,730890000B1479,,,,,,,,,,,,,0,,,,,S,sols,,,44,6.150139,45.529009
2021-1216621,2021-04-15,000001,Vente,2310,,,LONGEMALE,B060,73800,73089,Coise-Saint-Jean-Pied-Gauthier,73,,,730890000C1282,,,,,,,,,,,,,0,,,,,S,sols,,,66,6.134948,45.523006
2021-1216787,2021-04-22,000001,Vente,13000,,,AU MONNET,B073,73800,73089,Coise-Saint-Jean-Pied-Gauthier,73,,,730890000E0003,,,,,,,,,,,,,0,,,,,BT,taillis simples,,,15956,6.116937,45.514804
2021-1218691,2021-06-02,000001,Vente,20000,,,SOUS LE VILLARD,B109,73800,73089,Coise-Saint-Jean-Pied-Gauthier,73,,,730890000E0224,,,,,,,,,,,,,0,,,,,P,prés,,,8285,6.112504,45.508165
2021-1218691,2021-06-02,000001,Vente,20000,,,SOUS LE VILLARD,B109,73800,73089,Coise-Saint-Jean-Pied-Gauthier,73,,,730890000E0226,,,,,,,,,,,,,0,,,,,T,terres,,,4240,6.11219,45.507448
2021-1218691,2021-06-02,000001,Vente,20000,,,SAINT JOSEPH,B100,73800,73089,Coise-Saint-Jean-Pied-Gauthier,73,,,730890000E0300,,,,,,,,,,,,,0,,,,,P,prés,,,2640,6.110762,45.507103
2021-1218691,2021-06-02,000001,Vente,20000,,,SAINT JOSEPH,B100,73800,73089,Coise-Saint-Jean-Pied-Gauthier,73,,,730890000E1301,,,,,,,,,,,,,0,,,,,T,terres,,,81,6.109048,45.505971
2021-1218691,2021-06-02,000001,Vente,20000,,,SAINT JOSEPH,B100,73800,73089,Coise-Saint-Jean-Pied-Gauthier,73,,,730890000E1321,,,,,,,,,,,,,0,,,,,P,prés,,,11500,6.110327,45.506391
2021-1219174,2021-05-27,000001,Vente,179200,165,,RUE SOUS LE VILLARD,2170,73800,73089,Coise-Saint-Jean-Pied-Gauthier,73,,,730890000E1243,,,4,66.06,,,,,,,,,1,3,Dépendance,,0,,,,,,6.113678,45.508256
2021-1219174,2021-05-27,000001,Vente,179200,165,,RUE SOUS LE VILLARD,2170,73800,73089,Coise-Saint-Jean-Pied-Gauthier,73,,,730890000E1243,,,4,66.06,,,,,,,,,1,2,Appartement,68,3,,,,,,6.113678,45.508256
2021-1219174,2021-05-27,000001,Vente,179200,165,,RUE SOUS LE VILLARD,2170,73800,73089,Coise-Saint-Jean-Pied-Gauthier,73,,,730890000E1243,,,6,,,,,,,,,,1,3,Dépendance,,0,,,,,,6.113678,45.508256
2021-1219174,2021-05-27,000001,Vente,179200,165,,RUE SOUS LE VILLARD,2170,73800,73089,Coise-Saint-Jean-Pied-Gauthier,73,,,730890000E1243,,,4,66.06,,,,,,,,,1,3,Dépendance,,0,,,,,,6.113678,45.508256
2021-1219925,2021-05-31,000001,Vente,284745,40,,RUE DU FOUR,0830,73800,73089,Coise-Saint-Jean-Pied-Gauthier,73,,,730890000D0810,,,,,,,,,,,,,0,1,Maison,60,2,S,sols,,,917,6.122416,45.522217
2021-1219925,2021-05-31,000001,Vente,284745,40,,RUE DU FOUR,0830,73800,73089,Coise-Saint-Jean-Pied-Gauthier,73,,,730890000D0810,,,,,,,,,,,,,0,3,Dépendance,,0,S,sols,,,917,6.122416,45.522217
2021-1219992,2021-05-12,000001,Vente,110000,,,COISE,B020,73800,73089,Coise-Saint-Jean-Pied-Gauthier,73,,,730890000C1481,,,,,,,,,,,,,0,,,,,S,sols,,,36,6.144029,45.527588
2021-1219992,2021-05-12,000001,Vente,110000,,,COISE,B020,73800,73089,Coise-Saint-Jean-Pied-Gauthier,73,,,730890000C1616,,,,,,,,,,,,,0,,,,,S,sols,,,283,6.144001,45.527442
2021-1219992,2021-05-12,000001,Vente,110000,,,COISE,B020,73800,73089,Coise-Saint-Jean-Pied-Gauthier,73,,,730890000C1621,,,,,,,,,,,,,0,,,,,S,sols,,,21,6.144151,45.527401
2021-1219992,2021-05-12,000001,Vente,110000,,,COISE,B020,73800,73089,Coise-Saint-Jean-Pied-Gauthier,73,,,730890000C1622,,,,,,,,,,,,,0,,,,,S,sols,,,89,6.144436,45.527342
2021-1219992,2021-05-12,000001,Vente,110000,,,COISE,B020,73800,73089,Coise-Saint-Jean-Pied-Gauthier,73,,,730890000C1636,,,,,,,,,,,,,0,,,,,S,sols,,,226,6.144174,45.527535
2021-1219992,2021-05-12,000001,Vente,110000,,,COISE,B020,73800,73089,Coise-Saint-Jean-Pied-Gauthier,73,,,730890000C1637,,,,,,,,,,,,,0,,,,,S,sols,,,327,6.144205,45.527613
2021-1219992,2021-05-12,000001,Vente,110000,,,COISE,B020,73800,73089,Coise-Saint-Jean-Pied-Gauthier,73,,,730890000C1638,,,,,,,,,,,,,0,,,,,S,sols,,,248,6.144447,45.527486
2021-1220201,2021-06-25,000001,Vente,179600,59,,RUE DU VIEUX PUITS,1800,73800,73089,Coise-Saint-Jean-Pied-Gauthier,73,,,730890000B0636,,,,,,,,,,,,,0,1,Maison,105,5,S,sols,,,80,6.152851,45.534939
2021-1220201,2021-06-25,000001,Vente,179600,,,LE PUY,B095,73800,73089,Coise-Saint-Jean-Pied-Gauthier,73,,,730890000B1253,,,,,,,,,,,,,0,,,,,S,sols,,,69,6.152769,45.534922
2021-1220507,2021-06-17,000001,Vente,70000,,,COISE,B020,73800,73089,Coise-Saint-Jean-Pied-Gauthier,73,,,730890000C0410,,,,,,,,,,,,,0,,,,,S,sols,,,32,6.142567,45.526774
2021-1220507,2021-06-17,000001,Vente,70000,,,COISE,B020,73800,73089,Coise-Saint-Jean-Pied-Gauthier,73,,,730890000C0411,,,,,,,,,,,,,0,,,,,S,sols,,,20,6.142586,45.526693
2021-1220507,2021-06-17,000001,Vente,70000,35,,IMP DE LA GLYCINE,0900,73800,73089,Coise-Saint-Jean-Pied-Gauthier,73,,,730890000C0888,,,,,,,,,,,,,0,1,Maison,105,5,S,sols,,,583,6.142515,45.526679
2021-1221139,2021-07-02,000002,Vente,87500,,,LES PLANS,B087,73800,73089,Coise-Saint-Jean-Pied-Gauthier,73,,,730890000C1607,,,,,,,,,,,,,0,,,,,T,terres,,,797,,
2021-1221139,2021-07-02,000002,Vente,87500,,,LES PLANS,B087,73800,73089,Coise-Saint-Jean-Pied-Gauthier,73,,,730890000C1609,,,,,,,,,,,,,0,,,,,P,prés,,,223,,
2021-1221139,2021-07-02,000002,Vente,87500,,,LES PLANS,B087,73800,73089,Coise-Saint-Jean-Pied-Gauthier,73,,,730890000C1611,,,,,,,,,,,,,0,,,,,P,prés,,,69,6.14352,45.531179
2021-1221290,2021-07-02,000001,Vente,87500,,,LES PLANS,B087,73800,73089,Coise-Saint-Jean-Pied-Gauthier,73,,,730890000C1608,,,,,,,,,,,,,0,,,,,T,terres,,,770,,
2021-1221290,2021-07-02,000001,Vente,87500,,,LES PLANS,B087,73800,73089,Coise-Saint-Jean-Pied-Gauthier,73,,,730890000C1610,,,,,,,,,,,,,0,,,,,P,prés,,,460,,
2021-1221290,2021-07-02,000001,Vente,87500,,,LES PLANS,B087,73800,73089,Coise-Saint-Jean-Pied-Gauthier,73,,,730890000C1612,,,,,,,,,,,,,0,,,,,P,prés,,,92,6.144036,45.53144
2021-1221822,2021-07-28,000001,Vente,278400,9,,CHEM DE PIERRE OUTEND,1570,73800,73089,Coise-Saint-Jean-Pied-Gauthier,73,,,730890000B1342,,,,,,,,,,,,,0,1,Maison,115,5,S,sols,,,583,6.152843,45.535987
2021-1221822,2021-07-28,000001,Vente,278400,9,,CHEM DE PIERRE OUTEND,1570,73800,73089,Coise-Saint-Jean-Pied-Gauthier,73,,,730890000B1342,,,,,,,,,,,,,0,3,Dépendance,,0,S,sols,,,583,6.152843,45.535987
2021-1221822,2021-07-28,000001,Vente,278400,9,,CHEM DE PIERRE OUTEND,1570,73800,73089,Coise-Saint-Jean-Pied-Gauthier,73,,,730890000B1342,,,,,,,,,,,,,0,3,Dépendance,,0,S,sols,,,583,6.152843,45.535987
2021-1222192,2021-08-03,000001,Vente,140000,226,,RUE DU VILLARET,2200,73800,73089,Coise-Saint-Jean-Pied-Gauthier,73,,,73089000ZI0010,,,,,,,,,,,,,0,1,Maison,50,2,S,sols,,,1036,6.159432,45.537617
2021-1223083,2021-07-16,000001,Vente,74000,,,A NICOLE,B076,73800,73089,Coise-Saint-Jean-Pied-Gauthier,73,,,730890000E0630,,,,,,,,,,,,,0,,,,,VI,vignes,,,260,6.095635,45.499003
2021-1223083,2021-07-16,000001,Vente,74000,,,A NICOLE,B076,73800,73089,Coise-Saint-Jean-Pied-Gauthier,73,,,730890000E1122,,,,,,,,,,,,,0,,,,,VI,vignes,,,386,6.095768,45.498875
2021-1223083,2021-07-16,000001,Vente,74000,,,A NICOLE,B076,73800,73089,Coise-Saint-Jean-Pied-Gauthier,73,,,730890000E1124,,,,,,,,,,,,,0,,,,,P,prés,,,1023,6.096261,45.499294
2021-1223674,2021-08-03,000001,Vente,65000,,,COISE,B020,73800,73089,Coise-Saint-Jean-Pied-Gauthier,73,,,730890000C1639,,,,,,,,,,,,,0,,,,,S,sols,,,519,6.144545,45.527462
2021-1224143,2021-09-08,000001,Vente,70000,261,,RTE DU GRAND ARC,0020,73800,73089,Coise-Saint-Jean-Pied-Gauthier,73,,,730890000C1617,,,,,,,,,,,,,0,4,Local industriel. commercial ou assimilé,6001,0,S,sols,,,100,6.144177,45.527229
2021-1224143,2021-09-08,000001,Vente,70000,,,COISE,B020,73800,73089,Coise-Saint-Jean-Pied-Gauthier,73,,,730890000C1619,,,,,,,,,,,,,0,,,,,S,sols,,,508,6.144211,45.527321
2021-1224143,2021-09-08,000001,Vente,70000,,,COISE,B020,73800,73089,Coise-Saint-Jean-Pied-Gauthier,73,,,730890000C1622,,,,,,,,,,,,,0,,,,,S,sols,,,89,6.144436,45.527342
2021-1224143,2021-09-08,000001,Vente,70000,,,COISE,B020,73800,73089,Coise-Saint-Jean-Pied-Gauthier,73,,,730890000C1628,,,,,,,,,,,,,0,,,,,S,sols,,,6,6.144183,45.527185
2021-1224143,2021-09-08,000001,Vente,70000,,,COISE,B020,73800,73089,Coise-Saint-Jean-Pied-Gauthier,73,,,730890000C1638,,,,,,,,,,,,,0,,,,,S,sols,,,248,6.144447,45.527486
2021-1224143,2021-09-08,000001,Vente,70000,,,COISE,B020,73800,73089,Coise-Saint-Jean-Pied-Gauthier,73,,,730890000C1641,,,,,,,,,,,,,0,,,,,S,sols,,,1,6.144282,45.527456
2021-1224338,2021-09-17,000001,Vente,43000,,,LE MONNET,B074,73800,73089,Coise-Saint-Jean-Pied-Gauthier,73,,,730890000E0120,,,,,,,,,,,,,0,,,,,BT,taillis simples,,,120,6.116146,45.512296
2021-1224338,2021-09-17,000001,Vente,43000,,,LE MONNET,B074,73800,73089,Coise-Saint-Jean-Pied-Gauthier,73,,,730890000E0125,,,,,,,,,,,,,0,,,,,P,prés,,,250,6.11644,45.512474
2021-1224338,2021-09-17,000001,Vente,43000,,,LE MONNET,B074,73800,73089,Coise-Saint-Jean-Pied-Gauthier,73,,,730890000E0126,,,,,,,,,,,,,0,,,,,P,prés,,,345,6.116735,45.512587
2021-1225728,2021-09-24,000001,Vente,255000,430,,RTE DE LA RESISTANCE,1820,73800,73089,Coise-Saint-Jean-Pied-Gauthier,73,,,730890000B0499,,,,,,,,,,,,,0,1,Maison,110,4,S,sols,,,630,6.156994,45.537652
2021-1225728,2021-09-24,000001,Vente,255000,430,,RTE DE LA RESISTANCE,1820,73800,73089,Coise-Saint-Jean-Pied-Gauthier,73,,,730890000B0499,,,,,,,,,,,,,0,3,Dépendance,,0,S,sols,,,630,6.156994,45.537652
2021-1226762,2021-11-02,000001,Vente,195533,11,,RTE DE LA MAIRIE,1200,73800,73089,Coise-Saint-Jean-Pied-Gauthier,73,,,730890000C0387,,,,,,,,,,,,,0,1,Maison,125,3,S,sols,,,92,6.142685,45.526346
2021-1226762,2021-11-02,000001,Vente,195533,,,COISE,B020,73800,73089,Coise-Saint-Jean-Pied-Gauthier,73,,,730890000C1069,,,,,,,,,,,,,0,,,,,S,sols,,,24,6.142734,45.526276
2021-1226762,2021-11-02,000001,Vente,195533,,,COISE,B020,73800,73089,Coise-Saint-Jean-Pied-Gauthier,73,,,730890000C1478,,,,,,,,,,,,,0,,,,,S,sols,,,17,6.142757,45.526287
2021-1227109,2021-11-09,000001,Vente,541000,477,,RTE DES FRASSES,0850,73800,73089,Coise-Saint-Jean-Pied-Gauthier,73,,,730890000B0845,,,,,,,,,,,,,0,2,Appartement,67,3,S,sols,,,500,6.147825,45.532698
2021-1227109,2021-11-09,000001,Vente,541000,477,,RTE DES FRASSES,0850,73800,73089,Coise-Saint-Jean-Pied-Gauthier,73,,,730890000B0845,,,,,,,,,,,,,0,3,Dépendance,,0,T,terres,,,2530,6.147825,45.532698
2021-1227109,2021-11-09,000001,Vente,541000,477,,RTE DES FRASSES,0850,73800,73089,Coise-Saint-Jean-Pied-Gauthier,73,,,730890000B0845,,,,,,,,,,,,,0,3,Dépendance,,0,T,terres,,,2530,6.147825,45.532698
2021-1227109,2021-11-09,000001,Vente,541000,477,,RTE DES FRASSES,0850,73800,73089,Coise-Saint-Jean-Pied-Gauthier,73,,,730890000B0845,,,,,,,,,,,,,0,4,Local industriel. commercial ou assimilé,,,S,sols,,,500,6.147825,45.532698
2021-1227109,2021-11-09,000001,Vente,541000,477,,RTE DES FRASSES,0850,73800,73089,Coise-Saint-Jean-Pied-Gauthier,73,,,730890000B0845,,,,,,,,,,,,,0,2,Appartement,129,4,S,sols,,,500,6.147825,45.532698
2021-1227109,2021-11-09,000001,Vente,541000,477,,RTE DES FRASSES,0850,73800,73089,Coise-Saint-Jean-Pied-Gauthier,73,,,730890000B0845,,,,,,,,,,,,,0,2,Appartement,163,6,S,sols,,,500,6.147825,45.532698
2021-1227109,2021-11-09,000001,Vente,541000,477,,RTE DES FRASSES,0850,73800,73089,Coise-Saint-Jean-Pied-Gauthier,73,,,730890000B0845,,,,,,,,,,,,,0,3,Dépendance,,0,S,sols,,,500,6.147825,45.532698
2021-1227109,2021-11-09,000001,Vente,541000,477,,RTE DES FRASSES,0850,73800,73089,Coise-Saint-Jean-Pied-Gauthier,73,,,730890000B0845,,,,,,,,,,,,,0,3,Dépendance,,0,S,sols,,,500,6.147825,45.532698
2021-1227109,2021-11-09,000001,Vente,541000,477,,RTE DES FRASSES,0850,73800,73089,Coise-Saint-Jean-Pied-Gauthier,73,,,730890000B0845,,,,,,,,,,,,,0,3,Dépendance,,0,S,sols,,,500,6.147825,45.532698
2021-1227109,2021-11-09,000001,Vente,541000,477,,RTE DES FRASSES,0850,73800,73089,Coise-Saint-Jean-Pied-Gauthier,73,,,730890000B0845,,,,,,,,,,,,,0,3,Dépendance,,0,T,terres,,,2530,6.147825,45.532698
2021-1227109,2021-11-09,000001,Vente,541000,477,,RTE DES FRASSES,0850,73800,73089,Coise-Saint-Jean-Pied-Gauthier,73,,,730890000B0845,,,,,,,,,,,,,0,2,Appartement,67,3,T,terres,,,2530,6.147825,45.532698
2021-1227109,2021-11-09,000001,Vente,541000,477,,RTE DES FRASSES,0850,73800,73089,Coise-Saint-Jean-Pied-Gauthier,73,,,730890000B0845,,,,,,,,,,,,,0,2,Appartement,163,6,T,terres,,,2530,6.147825,45.532698
2021-1227109,2021-11-09,000001,Vente,541000,477,,RTE DES FRASSES,0850,73800,73089,Coise-Saint-Jean-Pied-Gauthier,73,,,730890000B0845,,,,,,,,,,,,,0,2,Appartement,129,4,T,terres,,,2530,6.147825,45.532698
2021-1227109,2021-11-09,000001,Vente,541000,477,,RTE DES FRASSES,0850,73800,73089,Coise-Saint-Jean-Pied-Gauthier,73,,,730890000B0845,,,,,,,,,,,,,0,4,Local industriel. commercial ou assimilé,,,T,terres,,,2530,6.147825,45.532698
2021-1227109,2021-11-09,000001,Vente,541000,,,AUX PLANS,B086,73800,73089,Coise-Saint-Jean-Pied-Gauthier,73,,,730890000B1078,,,,,,,,,,,,,0,,,,,T,terres,,,950,6.147478,45.532432
2021-1227468,2021-11-17,000002,Vente,83000,,,COISE,B020,73800,73089,Coise-Saint-Jean-Pied-Gauthier,73,,,730890000C1647,,,,,,,,,,,,,0,,,,,S,sols,,,547,6.142,45.525812
2021-1228439,2021-11-17,000001,Vente,600,,,COISE,B020,73800,73089,Coise-Saint-Jean-Pied-Gauthier,73,,,730890000C1648,,,,,,,,,,,,,0,,,,,S,sols,,,4,6.141935,45.525896
2021-1228439,2021-11-17,000001,Vente,600,,,COISE,B020,73800,73089,Coise-Saint-Jean-Pied-Gauthier,73,,,730890000C1649,,,,,,,,,,,,,0,,,,,S,sols,,,26,6.142068,45.525904
2021-1228693,2021-11-26,000001,Vente,85000,,,SAINT JOSEPH,B100,73800,73089,Coise-Saint-Jean-Pied-Gauthier,73,,,730890000E1298,,,,,,,,,,,,,0,,,,,T,terres,,,282,6.108719,45.505895
2021-1228693,2021-11-26,000001,Vente,85000,,,SAINT JOSEPH,B100,73800,73089,Coise-Saint-Jean-Pied-Gauthier,73,,,730890000E1302,,,,,,,,,,,,,0,,,,,T,terres,,,1294,6.109085,45.505483
2021-1228956,2021-12-10,000001,Vente,260000,8,,IMP DES FIGUETTES,0750,73800,73089,Coise-Saint-Jean-Pied-Gauthier,73,,,730890000C0180,,,,,,,,,,,,,0,1,Maison,144,7,S,sols,,,253,6.135803,45.530883
2021-1228956,2021-12-10,000001,Vente,260000,,,LES FRASSES,B039,73800,73089,Coise-Saint-Jean-Pied-Gauthier,73,,,730890000C0181,,,,,,,,,,,,,0,,,,,S,sols,,,135,6.135724,45.530811
2021-1228956,2021-12-10,000001,Vente,260000,,,SOUS CURTIL,B102,73800,73089,Coise-Saint-Jean-Pied-Gauthier,73,,,730890000C1251,,,,,,,,,,,,,0,,,,,S,sols,,,144,6.135954,45.530661
2021-1228956,2021-12-10,000001,Vente,260000,,,SOUS CURTIL,B102,73800,73089,Coise-Saint-Jean-Pied-Gauthier,73,,,730890000C1251,,,,,,,,,,,,,0,,,,,T,terres,,,500,6.135954,45.530661
2021-1229256,2021-12-17,000001,Vente,120000,201,,CHEM DE PIERRE OUTEND,1570,73800,73089,Coise-Saint-Jean-Pied-Gauthier,73,,,730890000B0989,,,,,,,,,,,,,0,1,Maison,37,1,S,sols,,,579,6.150846,45.53693
2021-1229256,2021-12-17,000001,Vente,120000,,,LE PUY,B095,73800,73089,Coise-Saint-Jean-Pied-Gauthier,73,,,730890000B0992,,,,,,,,,,,,,0,,,,,S,sols,,,306,6.15062,45.53697
