id_mutation,date_mutation,numero_disposition,nature_mutation,valeur_fonciere,adresse_numero,adresse_suffixe,adresse_nom_voie,adresse_code_voie,code_postal,code_commune,nom_commune,code_departement,ancien_code_commune,ancien_nom_commune,id_parcelle,ancien_id_parcelle,numero_volume,lot1_numero,lot1_surface_carrez,lot2_numero,lot2_surface_carrez,lot3_numero,lot3_surface_carrez,lot4_numero,lot4_surface_carrez,lot5_numero,lot5_surface_carrez,nombre_lots,code_type_local,type_local,surface_reelle_bati,nombre_pieces_principales,code_nature_culture,nature_culture,code_nature_culture_speciale,nature_culture_speciale,surface_terrain,longitude,latitude
2021-1213307,2021-01-22,000001,Vente,387014,,,BEYRIN,B009,73170,73299,Traize,73,,,732990000B1140,,,,,,,,,,,,,0,,,,,T,terres,,,331,5.735771,45.669441
2021-1213307,2021-01-22,000001,Vente,387014,,,BEYRIN,B009,73170,73299,Traize,73,,,732990000B1143,,,,,,,,,,,,,0,,,,,P,prés,,,131,5.735601,45.669691
2021-1213307,2021-01-22,000001,Vente,387014,,,BEYRIN,B009,73170,73299,Traize,73,,,732990000B1583,,,,,,,,,,,,,0,,,,,P,prés,,,45,5.735858,45.669304
2021-1213307,2021-01-22,000001,Vente,387014,,,BEYRIN,B009,73170,73299,Traize,73,,,732990000B1691,,,,,,,,,,,,,0,,,,,T,terres,,,213,5.73563,45.669586
2021-1213307,2021-01-22,000001,Vente,387014,5196,F,BEYRIN,B009,73170,73299,Traize,73,,,732990000B1692,,,,,,,,,,,,,0,1,Maison,97,4,S,sols,,,1284,5.73614,45.669436
2021-1213307,2021-01-22,000001,Vente,387014,,,BEYRIN,B009,73170,73299,Traize,73,,,732990000B1693,,,,,,,,,,,,,0,,,,,T,terres,,,51,5.736346,45.669304
2021-1213307,2021-01-22,000001,Vente,387014,,,BEYRIN,B009,73170,73299,Traize,73,,,732990000B1694,,,,,,,,,,,,,0,,,,,S,sols,,,122,5.735939,45.669532
2021-1213307,2021-01-22,000001,Vente,387014,,,BEYRIN,B009,73170,73299,Traize,73,,,732990000B1695,,,,,,,,,,,,,0,,,,,P,prés,,,130,5.735758,45.669621
2021-1214678,2021-02-19,000001,Vente,270,,,SOIRIN,B144,73170,73299,Traize,73,,,732990000A1069,,,,,,,,,,,,,0,,,,,S,sols,,,9,5.76,45.66623
2021-1215041,2021-02-26,000001,Vente,40000,,,SOIRIN,B144,73170,73299,Traize,73,,,732990000A1069,,,,,,,,,,,,,0,,,,,S,sols,,,9,5.76,45.66623
2021-1215041,2021-02-26,000001,Vente,40000,5084,,SOIRIN,B144,73170,73299,Traize,73,,,732990000A1072,,,,,,,,,,,,,0,1,Maison,30,1,S,sols,,,135,,
2021-1215041,2021-02-26,000001,Vente,40000,,,SOIRIN,B144,73170,73299,Traize,73,,,732990000A1074,,,,,,,,,,,,,0,,,,,S,sols,,,87,5.760091,45.666146
2021-1215041,2021-02-26,000001,Vente,40000,,,SOIRIN,B144,73170,73299,Traize,73,,,732990000A1124,,,,,,,,,,,,,0,,,,,AB,terrains a bâtir,,,15,5.759941,45.66622
2021-1215041,2021-02-26,000001,Vente,40000,,,SOIRIN,B144,73170,73299,Traize,73,,,732990000A1127,,,,,,,,,,,,,0,,,,,S,sols,,,43,5.759889,45.666204
2021-1218104,2021-02-26,000001,Vente,1,,,LA PONCETTE,B122,73170,73299,Traize,73,,,732990000A0819,,,,,,,,,,,,,0,,,,,P,prés,,,1080,5.758196,45.674234
2021-1229749,2021-12-15,000001,Vente,676500,5172,F,LA TUILIERE,B157,73170,73299,Traize,73,,,732990000B0173,,,,,,,,,,,,,0,1,Maison,272,9,S,sols,,,126,5.729293,45.664719
2021-1229749,2021-12-15,000001,Vente,676500,5172,F,LA TUILIERE,B157,73170,73299,Traize,73,,,732990000B0173,,,,,,,,,,,,,0,3,Dépendance,,0,S,sols,,,126,5.729293,45.664719
2021-1229749,2021-12-15,000001,Vente,676500,,,LA TUILIERE,B157,73170,73299,Traize,73,,,732990000B0174,,,,,,,,,,,,,0,,,,,S,sols,,,80,5.729273,45.664773
2021-1229749,2021-12-15,000001,Vente,676500,,,NAVETTE,B104,73170,73299,Traize,73,,,732990000B1553,,,,,,,,,,,,,0,,,,,P,prés,,,173,5.729463,45.664835
2021-1229749,2021-12-15,000001,Vente,676500,,,LA TUILIERE,B157,73170,73299,Traize,73,,,732990000B1556,,,,,,,,,,,,,0,,,,,S,sols,,,116,5.729324,45.664659
2021-1229749,2021-12-15,000001,Vente,676500,,,LA TUILIERE,B157,73170,73299,Traize,73,,,732990000B1558,,,,,,,,,,,,,0,,,,,P,prés,,,2203,5.729125,45.664709
