id_mutation,date_mutation,numero_disposition,nature_mutation,valeur_fonciere,adresse_numero,adresse_suffixe,adresse_nom_voie,adresse_code_voie,code_postal,code_commune,nom_commune,code_departement,ancien_code_commune,ancien_nom_commune,id_parcelle,ancien_id_parcelle,numero_volume,lot1_numero,lot1_surface_carrez,lot2_numero,lot2_surface_carrez,lot3_numero,lot3_surface_carrez,lot4_numero,lot4_surface_carrez,lot5_numero,lot5_surface_carrez,nombre_lots,code_type_local,type_local,surface_reelle_bati,nombre_pieces_principales,code_nature_culture,nature_culture,code_nature_culture_speciale,nature_culture_speciale,surface_terrain,longitude,latitude
2021-1231000,2021-01-14,000001,Vente,330000,95,,RTE D'ANNECY,0030,74540,74310,Viuz-la-Chiésaz,74,,,743100000C2116,,,16,,,,,,,,,,1,3,Dépendance,,0,,,,,,6.06091,45.810446
2021-1231000,2021-01-14,000001,Vente,330000,95,,RTE D'ANNECY,0030,74540,74310,Viuz-la-Chiésaz,74,,,743100000C2116,,,15,,,,,,,,,,1,3,Dépendance,,0,,,,,,6.06091,45.810446
2021-1231000,2021-01-14,000001,Vente,330000,95,,RTE D'ANNECY,0030,74540,74310,Viuz-la-Chiésaz,74,,,743100000C2116,,,27,,,,,,,,,,1,2,Appartement,103,4,,,,,,6.06091,45.810446
2021-1231031,2021-01-15,000001,Vente,597300,380,,RTE DES PIERRES,0280,74540,74310,Viuz-la-Chiésaz,74,,,743100000C0686,,,,,,,,,,,,,0,1,Maison,91,5,T,terres,,,1220,6.062237,45.805877
2021-1231031,2021-01-15,000001,Vente,597300,380,,RTE DES PIERRES,0280,74540,74310,Viuz-la-Chiésaz,74,,,743100000C0686,,,,,,,,,,,,,0,3,Dépendance,,0,T,terres,,,1220,6.062237,45.805877
2021-1231031,2021-01-15,000001,Vente,597300,380,,RTE DES PIERRES,0280,74540,74310,Viuz-la-Chiésaz,74,,,743100000C0686,,,,,,,,,,,,,0,1,Maison,91,5,S,sols,,,1352,6.062237,45.805877
2021-1231031,2021-01-15,000001,Vente,597300,380,,RTE DES PIERRES,0280,74540,74310,Viuz-la-Chiésaz,74,,,743100000C0686,,,,,,,,,,,,,0,3,Dépendance,,0,S,sols,,,1352,6.062237,45.805877
2021-1231542,2021-01-22,000001,Vente,205000,,,VIUZ SUD,B192,74540,74310,Viuz-la-Chiésaz,74,,,743100000C2346,,,,,,,,,,,,,0,,,,,P,prés,,,518,6.064253,45.809458
2021-1231542,2021-01-22,000001,Vente,205000,100,,CHE DU CRET DU NANT,0190,74540,74310,Viuz-la-Chiésaz,74,,,743100000C2347,,,,,,,,,,,,,0,1,Maison,72,5,S,sols,,,271,6.063952,45.809676
2021-1231542,2021-01-22,000001,Vente,205000,,,VIUZ SUD,B192,74540,74310,Viuz-la-Chiésaz,74,,,743100000C2350,,,,,,,,,,,,,0,,,,,T,terres,,,60,6.06393,45.80962
2021-1231979,2021-02-12,000001,Vente,419000,1160,,RTE DE CHEZ MERMET,0160,74540,74310,Viuz-la-Chiésaz,74,,,743100000A0891,,,1,138.05,,,,,,,,,1,2,Appartement,130,4,,,,,,6.048856,45.822361
2021-1231979,2021-02-12,000001,Vente,419000,1160,,RTE DE CHEZ MERMET,0160,74540,74310,Viuz-la-Chiésaz,74,,,743100000A0891,,,1,138.05,,,,,,,,,1,3,Dépendance,,0,,,,,,6.048856,45.822361
2021-1232381,2021-02-17,000001,Vente,250000,,,CHEZ LAVY,B044,74540,74310,Viuz-la-Chiésaz,74,,,743100000A1585,,,,,,,,,,,,,0,,,,,S,sols,,,61,6.060235,45.828191
2021-1232381,2021-02-17,000001,Vente,250000,25,,CHE DE CHEZ LAVY,0150,74540,74310,Viuz-la-Chiésaz,74,,,743100000A1634,,,,,,,,,,,,,0,2,Appartement,80,3,S,sols,,,200,6.060387,45.828031
2021-1232381,2021-02-17,000001,Vente,250000,25,,CHE DE CHEZ LAVY,0150,74540,74310,Viuz-la-Chiésaz,74,,,743100000A1634,,,,,,,,,,,,,0,2,Appartement,80,3,J,jardins,,,218,6.060387,45.828031
2021-1232381,2021-02-17,000001,Vente,250000,25,,CHE DE CHEZ LAVY,0150,74540,74310,Viuz-la-Chiésaz,74,,,743100000A1634,,,,,,,,,,,,,0,3,Dépendance,,0,J,jardins,,,218,6.060387,45.828031
2021-1232381,2021-02-17,000001,Vente,250000,25,,CHE DE CHEZ LAVY,0150,74540,74310,Viuz-la-Chiésaz,74,,,743100000A1634,,,,,,,,,,,,,0,3,Dépendance,,0,S,sols,,,200,6.060387,45.828031
2021-1232381,2021-02-17,000001,Vente,250000,,,CHEZ LAVY,B044,74540,74310,Viuz-la-Chiésaz,74,,,743100000A1637,,,,,,,,,,,,,0,,,,,T,terres,,,10,6.060393,45.827955
2021-1233426,2021-03-22,000001,Echange,34401,531,,RTE D'ANNECY,0030,74540,74310,Viuz-la-Chiésaz,74,,,743100000C1590,,,12,,,,,,,,,,1,2,Appartement,24,1,,,,,,6.059554,45.813919
2021-1233427,2021-03-22,000002,Echange,8986,531,,RTE D'ANNECY,0030,74540,74310,Viuz-la-Chiésaz,74,,,743100000C1590,,,10,,,,,,,,,,1,2,Appartement,81,3,,,,,,6.059554,45.813919
2021-1237009,2021-06-24,000001,Vente,149000,94,,CHE DE LA GRAND MAISON,0220,74540,74310,Viuz-la-Chiésaz,74,,,743100000C0228,,,18,,32,,,,,,,,2,3,Dépendance,,0,,,,,,6.060824,45.809508
2021-1237009,2021-06-24,000001,Vente,149000,94,,CHE DE LA GRAND MAISON,0220,74540,74310,Viuz-la-Chiésaz,74,,,743100000C0228,,,18,,32,,,,,,,,2,2,Appartement,33,1,,,,,,6.060824,45.809508
2021-1238321,2021-07-20,000001,Vente,509000,,,LA RAVOIRE,B166,74540,74310,Viuz-la-Chiésaz,74,,,743100000C1916,,,,,,,,,,,,,0,,,,,T,terres,,,149,6.06069,45.813943
2021-1238321,2021-07-20,000001,Vente,509000,,,LA RAVOIRE,B166,74540,74310,Viuz-la-Chiésaz,74,,,743100000C1920,,,,,,,,,,,,,0,,,,,T,terres,,,4,6.060825,45.813858
2021-1238321,2021-07-20,000001,Vente,509000,,,LA RAVOIRE,B166,74540,74310,Viuz-la-Chiésaz,74,,,743100000C1924,,,,,,,,,,,,,0,,,,,P,prés,,,96,6.060878,45.813798
2021-1238321,2021-07-20,000001,Vente,509000,51,,ALL DE LA RAVOIRE,0310,74540,74310,Viuz-la-Chiésaz,74,,,743100000C1982,,,,,,,,,,,,,0,1,Maison,111,5,S,sols,,,1255,6.060786,45.814026
2021-1239141,2021-08-13,000001,Vente,486000,1341,,RTE DE QUINTAL,0300,74540,74310,Viuz-la-Chiésaz,74,,,743100000A1108,,,1,,,,,,,,,,1,3,Dépendance,,0,S,sols,,,981,6.065625,45.822898
2021-1239141,2021-08-13,000001,Vente,486000,1341,,RTE DE QUINTAL,0300,74540,74310,Viuz-la-Chiésaz,74,,,743100000A1108,,,1,,,,,,,,,,1,3,Dépendance,,0,S,sols,,,981,6.065625,45.822898
2021-1239141,2021-08-13,000001,Vente,486000,1341,,RTE DE QUINTAL,0300,74540,74310,Viuz-la-Chiésaz,74,,,743100000A1108,,,1,,,,,,,,,,1,3,Dépendance,,0,S,sols,,,981,6.065625,45.822898
2021-1239141,2021-08-13,000001,Vente,486000,1341,,RTE DE QUINTAL,0300,74540,74310,Viuz-la-Chiésaz,74,,,743100000A1108,,,1,,,,,,,,,,1,3,Dépendance,,0,S,sols,,,981,6.065625,45.822898
2021-1239141,2021-08-13,000001,Vente,486000,1341,,RTE DE QUINTAL,0300,74540,74310,Viuz-la-Chiésaz,74,,,743100000A1108,,,1,,,,,,,,,,1,2,Appartement,67,3,S,sols,,,981,6.065625,45.822898
2021-1239141,2021-08-13,000001,Vente,486000,1341,,RTE DE QUINTAL,0300,74540,74310,Viuz-la-Chiésaz,74,,,743100000A1108,,,1,,,,,,,,,,1,3,Dépendance,,0,S,sols,,,981,6.065625,45.822898
2021-1239141,2021-08-13,000001,Vente,486000,1341,,RTE DE QUINTAL,0300,74540,74310,Viuz-la-Chiésaz,74,,,743100000A1108,,,1,,,,,,,,,,1,3,Dépendance,,0,S,sols,,,981,6.065625,45.822898
2021-1239141,2021-08-13,000001,Vente,486000,1341,,RTE DE QUINTAL,0300,74540,74310,Viuz-la-Chiésaz,74,,,743100000A1108,,,1,,,,,,,,,,1,2,Appartement,99,3,S,sols,,,981,6.065625,45.822898
2021-1239141,2021-08-13,000001,Vente,486000,1341,,RTE DE QUINTAL,0300,74540,74310,Viuz-la-Chiésaz,74,,,743100000A1108,,,1,,,,,,,,,,1,3,Dépendance,,0,S,sols,,,981,6.065625,45.822898
2021-1239141,2021-08-13,000001,Vente,486000,1341,,RTE DE QUINTAL,0300,74540,74310,Viuz-la-Chiésaz,74,,,743100000A1108,,,1,,,,,,,,,,1,2,Appartement,57,3,S,sols,,,981,6.065625,45.822898
2021-1239141,2021-08-13,000001,Vente,486000,,,LA BERNADE,B007,74540,74310,Viuz-la-Chiésaz,74,,,743100000A1201,,,,,,,,,,,,,0,,,,,BR,futaies résineuses,SAPIN,Sapins ou sapinière,220,6.065508,45.822639
2021-1240876,2021-09-21,000001,Vente,238000,1460,,RTE D'ANNECY,0030,74540,74310,Viuz-la-Chiésaz,74,,,743100000A1235,,,,,,,,,,,,,0,2,Appartement,54,2,S,sols,,,402,6.059038,45.82204
2021-1240876,2021-09-21,000001,Vente,238000,1460,,RTE D'ANNECY,0030,74540,74310,Viuz-la-Chiésaz,74,,,743100000A1235,,,,,,,,,,,,,0,3,Dépendance,,0,S,sols,,,402,6.059038,45.82204
2021-1240876,2021-09-21,000001,Vente,238000,1460,,RTE D'ANNECY,0030,74540,74310,Viuz-la-Chiésaz,74,,,743100000A1235,,,,,,,,,,,,,0,2,Appartement,57,3,S,sols,,,402,6.059038,45.82204
2021-1240876,2021-09-21,000001,Vente,238000,1460,,RTE D'ANNECY,0030,74540,74310,Viuz-la-Chiésaz,74,,,743100000A1235,,,,,,,,,,,,,0,3,Dépendance,,0,S,sols,,,402,6.059038,45.82204
2021-1240876,2021-09-21,000001,Vente,238000,,,CHEZ THOME,B051,74540,74310,Viuz-la-Chiésaz,74,,,743100000A1352,,,,,,,,,,,,,0,,,,,T,terres,,,1490,6.059143,45.821922
2021-1240968,2021-09-24,000001,Vente,535950,605,,CHE DU CRET DE LA TOUR,0170,74540,74310,Viuz-la-Chiésaz,74,,,743100000A1382,,,,,,,,,,,,,0,1,Maison,95,4,S,sols,,,1372,6.059201,45.822344
2021-1240968,2021-09-24,000001,Vente,535950,605,,CHE DU CRET DE LA TOUR,0170,74540,74310,Viuz-la-Chiésaz,74,,,743100000A1382,,,,,,,,,,,,,0,3,Dépendance,,0,S,sols,,,1372,6.059201,45.822344
2021-1240968,2021-09-24,000001,Vente,535950,605,,CHE DU CRET DE LA TOUR,0170,74540,74310,Viuz-la-Chiésaz,74,,,743100000A1382,,,,,,,,,,,,,0,3,Dépendance,,0,S,sols,,,1372,6.059201,45.822344
2021-1242614,2021-10-29,000001,Vente,400750,,,BARRAUX,B005,74540,74310,Viuz-la-Chiésaz,74,,,743100000C2000,,,,,,,,,,,,,0,,,,,BR,futaies résineuses,SAPIN,Sapins ou sapinière,10,6.059539,45.799585
2021-1242614,2021-10-29,000001,Vente,400750,,,BARRAUX,B005,74540,74310,Viuz-la-Chiésaz,74,,,743100000C2002,,,,,,,,,,,,,0,,,,,T,terres,,,241,6.059764,45.799625
2021-1243807,2021-12-04,000001,Vente,200000,5,,ALL FLEURY,0215,74540,74310,Viuz-la-Chiésaz,74,,,743100000C2068,,,,,,,,,,,,,0,,,,,AB,terrains a bâtir,,,859,6.060334,45.812724
2021-1243809,2021-12-04,000001,Vente,250000,7,,ALL FLEURY,0215,74540,74310,Viuz-la-Chiésaz,74,,,743100000C2069,,,,,,,,,,,,,0,1,Maison,125,5,S,sols,,,864,6.060181,45.81299
2021-1243810,2021-12-04,000002,Vente,125000,7,,ALL FLEURY,0215,74540,74310,Viuz-la-Chiésaz,74,,,743100000C2069,,,,,,,,,,,,,0,1,Maison,125,5,S,sols,,,864,6.060181,45.81299
