id_mutation,date_mutation,numero_disposition,nature_mutation,valeur_fonciere,adresse_numero,adresse_suffixe,adresse_nom_voie,adresse_code_voie,code_postal,code_commune,nom_commune,code_departement,ancien_code_commune,ancien_nom_commune,id_parcelle,ancien_id_parcelle,numero_volume,lot1_numero,lot1_surface_carrez,lot2_numero,lot2_surface_carrez,lot3_numero,lot3_surface_carrez,lot4_numero,lot4_surface_carrez,lot5_numero,lot5_surface_carrez,nombre_lots,code_type_local,type_local,surface_reelle_bati,nombre_pieces_principales,code_nature_culture,nature_culture,code_nature_culture_speciale,nature_culture_speciale,surface_terrain,longitude,latitude
2021-1267551,2021-11-03,000001,Vente,222000,,,LES DEUX MARES FERME,B008,76220,76450,Montroty,76,,,764500000A0197,,,,,,,,,,,,,0,,,,,VE,vergers,,,617,1.671378,49.454222
2021-1267551,2021-11-03,000001,Vente,222000,407,,RUE DES DEUX MARES,0040,76220,76450,Montroty,76,,,764500000A0295,,,,,,,,,,,,,0,3,Dépendance,,0,S,sols,,,1000,1.671482,49.454433
2021-1267551,2021-11-03,000001,Vente,222000,407,,RUE DES DEUX MARES,0040,76220,76450,Montroty,76,,,764500000A0295,,,,,,,,,,,,,0,1,Maison,65,1,J,jardins,,,426,1.671482,49.454433
2021-1267551,2021-11-03,000001,Vente,222000,407,,RUE DES DEUX MARES,0040,76220,76450,Montroty,76,,,764500000A0295,,,,,,,,,,,,,0,3,Dépendance,,0,J,jardins,,,426,1.671482,49.454433
2021-1267551,2021-11-03,000001,Vente,222000,407,,RUE DES DEUX MARES,0040,76220,76450,Montroty,76,,,764500000A0295,,,,,,,,,,,,,0,3,Dépendance,,0,J,jardins,,,426,1.671482,49.454433
2021-1267551,2021-11-03,000001,Vente,222000,407,,RUE DES DEUX MARES,0040,76220,76450,Montroty,76,,,764500000A0295,,,,,,,,,,,,,0,1,Maison,65,1,S,sols,,,1000,1.671482,49.454433
2021-1267551,2021-11-03,000001,Vente,222000,407,,RUE DES DEUX MARES,0040,76220,76450,Montroty,76,,,764500000A0295,,,,,,,,,,,,,0,3,Dépendance,,0,S,sols,,,1000,1.671482,49.454433
2021-1267787,2021-12-02,000001,Vente,156500,126,,RUE DU BORD DU BOIS,0020,76220,76450,Montroty,76,,,764500000C0186,,,,,,,,,,,,,0,1,Maison,120,5,S,sols,,,1000,1.662382,49.434086
2021-1267787,2021-12-02,000001,Vente,156500,126,,RUE DU BORD DU BOIS,0020,76220,76450,Montroty,76,,,764500000C0186,,,,,,,,,,,,,0,1,Maison,120,5,J,jardins,,,663,1.662382,49.434086
2021-1287060,2021-02-02,000001,Vente,194000,535,,RUE DES DEUX MARES,0040,76220,76450,Montroty,76,,,764500000A0248,,,,,,,,,,,,,0,1,Maison,98,4,S,sols,,,500,1.670232,49.454878
2021-1287060,2021-02-02,000001,Vente,194000,535,,RUE DES DEUX MARES,0040,76220,76450,Montroty,76,,,764500000A0248,,,,,,,,,,,,,0,1,Maison,98,4,VE,vergers,,,1272,1.670232,49.454878
2021-1287070,2021-01-21,000001,Vente,140000,180,,RUE DES ENCLOS,0055,76220,76450,Montroty,76,,,764500000B0375,,,,,,,,,,,,,0,1,Maison,84,3,S,sols,,,187,1.665244,49.438958
2021-1287865,2021-07-10,000001,Vente,179000,32,,CHE DE LA COTE D OLIVIERS,0035,76220,76450,Montroty,76,,,764500000B0431,,,,,,,,,,,,,0,1,Maison,105,5,S,sols,,,780,1.666736,49.439172
2021-1287865,2021-07-10,000001,Vente,179000,32,,CHE DE LA COTE D OLIVIERS,0035,76220,76450,Montroty,76,,,764500000B0431,,,,,,,,,,,,,0,3,Dépendance,,0,S,sols,,,780,1.666736,49.439172
2021-1287899,2021-07-30,000001,Vente,159000,,,RUE DES ENCLOS,0055,76220,76450,Montroty,76,,,764500000B0273,,,,,,,,,,,,,0,1,Maison,84,3,J,jardins,,,511,1.666004,49.440734
2021-1287899,2021-07-30,000001,Vente,159000,,,RUE DES ENCLOS,0055,76220,76450,Montroty,76,,,764500000B0273,,,,,,,,,,,,,0,3,Dépendance,,0,J,jardins,,,511,1.666004,49.440734
2021-1287899,2021-07-30,000001,Vente,159000,,,RUE DES ENCLOS,0055,76220,76450,Montroty,76,,,764500000B0273,,,,,,,,,,,,,0,1,Maison,84,3,S,sols,,,91,1.666004,49.440734
2021-1287899,2021-07-30,000001,Vente,159000,,,RUE DES ENCLOS,0055,76220,76450,Montroty,76,,,764500000B0273,,,,,,,,,,,,,0,3,Dépendance,,0,S,sols,,,91,1.666004,49.440734
2021-1287947,2021-07-28,000001,Vente,77875,412,,PL DE L EGLISE,0050,76220,76450,Montroty,76,,,764500000B0043,,,,,,,,,,,,,0,1,Maison,40,2,S,sols,,,245,1.66585,49.438998
2021-1288027,2021-08-27,000001,Vente,179000,68,,RUE DU BORD DU BOIS,0020,76220,76450,Montroty,76,,,764500000C0187,,,,,,,,,,,,,0,1,Maison,110,3,S,sols,,,1000,1.662889,49.434541
2021-1288027,2021-08-27,000001,Vente,179000,68,,RUE DU BORD DU BOIS,0020,76220,76450,Montroty,76,,,764500000C0187,,,,,,,,,,,,,0,3,Dépendance,,0,J,jardins,,,1528,1.662889,49.434541
2021-1288027,2021-08-27,000001,Vente,179000,68,,RUE DU BORD DU BOIS,0020,76220,76450,Montroty,76,,,764500000C0187,,,,,,,,,,,,,0,1,Maison,110,3,J,jardins,,,1528,1.662889,49.434541
2021-1288027,2021-08-27,000001,Vente,179000,68,,RUE DU BORD DU BOIS,0020,76220,76450,Montroty,76,,,764500000C0187,,,,,,,,,,,,,0,3,Dépendance,,0,S,sols,,,1000,1.662889,49.434541
2021-1288028,2021-08-27,000001,Vente,239000,281,,RUE DE FOLLEVILLE,0060,76220,76450,Montroty,76,,,764500000B0425,,,,,,,,,,,,,0,3,Dépendance,,0,S,sols,,,1305,1.681042,49.439596
2021-1288028,2021-08-27,000001,Vente,239000,281,,RUE DE FOLLEVILLE,0060,76220,76450,Montroty,76,,,764500000B0425,,,,,,,,,,,,,0,3,Dépendance,,0,S,sols,,,1305,1.681042,49.439596
2021-1288028,2021-08-27,000001,Vente,239000,281,,RUE DE FOLLEVILLE,0060,76220,76450,Montroty,76,,,764500000B0425,,,,,,,,,,,,,0,1,Maison,148,6,S,sols,,,1305,1.681042,49.439596
