id_mutation,date_mutation,numero_disposition,nature_mutation,valeur_fonciere,adresse_numero,adresse_suffixe,adresse_nom_voie,adresse_code_voie,code_postal,code_commune,nom_commune,code_departement,ancien_code_commune,ancien_nom_commune,id_parcelle,ancien_id_parcelle,numero_volume,lot1_numero,lot1_surface_carrez,lot2_numero,lot2_surface_carrez,lot3_numero,lot3_surface_carrez,lot4_numero,lot4_surface_carrez,lot5_numero,lot5_surface_carrez,nombre_lots,code_type_local,type_local,surface_reelle_bati,nombre_pieces_principales,code_nature_culture,nature_culture,code_nature_culture_speciale,nature_culture_speciale,surface_terrain,longitude,latitude
2021-1268105,2021-12-13,000001,Vente,142000,1,,CHE DES JONQUERETTES,0105,76750,76581,Saint-Germain-des-Essourts,76,,,76581000AI0134,,,,,,,,,,,,,0,1,Maison,90,3,S,sols,,,500,1.302672,49.521427
2021-1268105,2021-12-13,000001,Vente,142000,1,,CHE DES JONQUERETTES,0105,76750,76581,Saint-Germain-des-Essourts,76,,,76581000AI0134,,,,,,,,,,,,,0,1,Maison,90,3,AG,terrains d'agrément,,,699,1.302672,49.521427
2021-1270764,2021-02-01,000002,Echange,10899,,,BOIS DU QUESNAY,B003,76750,76581,Saint-Germain-des-Essourts,76,,,76581000AM0026,,,,,,,,,,,,,0,,,,,BT,taillis simples,,,358,1.309265,49.540892
2021-1270764,2021-02-01,000002,Echange,10899,,,BOIS DU QUESNAY,B003,76750,76581,Saint-Germain-des-Essourts,76,,,76581000AM0027,,,,,,,,,,,,,0,,,,,T,terres,,,7835,1.307634,49.541221
2021-1270764,2021-02-01,000002,Echange,10899,,,BOIS DU QUESNAY,B003,76750,76581,Saint-Germain-des-Essourts,76,,,76581000AM0027,,,,,,,,,,,,,0,,,,,T,terres,,,3917,1.307634,49.541221
2021-1271086,2021-03-30,000001,Vente,75270,,,RAIMBOUVILLE,B014,76750,76581,Saint-Germain-des-Essourts,76,,,76581000ZA0015,,,,,,,,,,,,,0,,,,,T,terres,,,75266,1.337798,49.534092
2021-1271371,2021-04-28,000001,Vente,18000,2,,CHE DES JONQUERETTES,0105,76750,76581,Saint-Germain-des-Essourts,76,,,76581000AI0115,,,,,,,,,,,,,0,3,Dépendance,,0,S,sols,,,144,1.30315,49.521081
2021-1271430,2021-05-17,000001,Vente,138000,9999,F,ALL DU CIMETIERE,0034,76750,76581,Saint-Germain-des-Essourts,76,,,76581000AL0114,,,,,,,,,,,,,0,3,Dépendance,,0,AG,terrains d'agrément,,,527,1.313117,49.533516
2021-1271430,2021-05-17,000001,Vente,138000,9999,F,ALL DU CIMETIERE,0034,76750,76581,Saint-Germain-des-Essourts,76,,,76581000AL0114,,,,,,,,,,,,,0,1,Maison,75,4,S,sols,,,500,1.313117,49.533516
2021-1271430,2021-05-17,000001,Vente,138000,9999,F,ALL DU CIMETIERE,0034,76750,76581,Saint-Germain-des-Essourts,76,,,76581000AL0114,,,,,,,,,,,,,0,3,Dépendance,,0,S,sols,,,500,1.313117,49.533516
2021-1271430,2021-05-17,000001,Vente,138000,9999,F,ALL DU CIMETIERE,0034,76750,76581,Saint-Germain-des-Essourts,76,,,76581000AL0114,,,,,,,,,,,,,0,1,Maison,75,4,AG,terrains d'agrément,,,527,1.313117,49.533516
2021-1271654,2021-05-28,000001,Vente,50000,,,RAIMBOUVILLE,B014,76750,76581,Saint-Germain-des-Essourts,76,,,76581000AD0114,,,,,,,,,,,,,0,,,,,P,prés,,,11447,1.342029,49.531384
2021-1271654,2021-05-28,000001,Vente,50000,,,RAIMBOUVILLE,B014,76750,76581,Saint-Germain-des-Essourts,76,,,76581000AD0114,,,,,,,,,,,,,0,,,,,S,sols,,,2000,1.342029,49.531384
2021-1271672,2021-05-28,000001,Vente,65000,2,,RAIMBOUVILLE,B014,76750,76581,Saint-Germain-des-Essourts,76,,,76581000AD0115,,,,,,,,,,,,,0,1,Maison,105,5,AG,terrains d'agrément,,,1358,1.341613,49.53217
2021-1271672,2021-05-28,000001,Vente,65000,2,,RAIMBOUVILLE,B014,76750,76581,Saint-Germain-des-Essourts,76,,,76581000AD0115,,,,,,,,,,,,,0,1,Maison,105,5,S,sols,,,1000,1.341613,49.53217
2021-1272070,2021-07-06,000001,Vente,368000,5102,,FONTAINE CHATEL,B012,76750,76581,Saint-Germain-des-Essourts,76,,,76581000AH0099,,,,,,,,,,,,,0,3,Dépendance,,0,AG,terrains d'agrément,,,2020,1.308126,49.528771
2021-1272070,2021-07-06,000001,Vente,368000,5102,,FONTAINE CHATEL,B012,76750,76581,Saint-Germain-des-Essourts,76,,,76581000AH0099,,,,,,,,,,,,,0,1,Maison,240,6,S,sols,,,500,1.308126,49.528771
2021-1272070,2021-07-06,000001,Vente,368000,5102,,FONTAINE CHATEL,B012,76750,76581,Saint-Germain-des-Essourts,76,,,76581000AH0099,,,,,,,,,,,,,0,1,Maison,240,6,AG,terrains d'agrément,,,2020,1.308126,49.528771
2021-1272070,2021-07-06,000001,Vente,368000,5102,,FONTAINE CHATEL,B012,76750,76581,Saint-Germain-des-Essourts,76,,,76581000AH0099,,,,,,,,,,,,,0,3,Dépendance,,0,S,sols,,,500,1.308126,49.528771
2021-1272835,2021-08-03,000001,Vente,249000,1,,RTE DU PIGEONNIER,0164,76750,76581,Saint-Germain-des-Essourts,76,,,76581000AC0390,,,,,,,,,,,,,0,3,Dépendance,,0,AG,terrains d'agrément,,,2268,1.317386,49.537782
2021-1272835,2021-08-03,000001,Vente,249000,1,,RTE DU PIGEONNIER,0164,76750,76581,Saint-Germain-des-Essourts,76,,,76581000AC0390,,,,,,,,,,,,,0,1,Maison,169,6,S,sols,,,1000,1.317386,49.537782
2021-1272835,2021-08-03,000001,Vente,249000,1,,RTE DU PIGEONNIER,0164,76750,76581,Saint-Germain-des-Essourts,76,,,76581000AC0390,,,,,,,,,,,,,0,1,Maison,169,6,AG,terrains d'agrément,,,2268,1.317386,49.537782
2021-1272835,2021-08-03,000001,Vente,249000,1,,RTE DU PIGEONNIER,0164,76750,76581,Saint-Germain-des-Essourts,76,,,76581000AC0390,,,,,,,,,,,,,0,3,Dépendance,,0,S,sols,,,1000,1.317386,49.537782
2021-1272971,2021-07-22,000001,Vente,207400,5065,,SAINT GERMAIN,B015,76750,76581,Saint-Germain-des-Essourts,76,,,76581000AL0130,,,,,,,,,,,,,0,1,Maison,200,5,AG,terrains d'agrément,,,914,1.312704,49.53357
2021-1272971,2021-07-22,000001,Vente,207400,5065,,SAINT GERMAIN,B015,76750,76581,Saint-Germain-des-Essourts,76,,,76581000AL0130,,,,,,,,,,,,,0,1,Maison,200,5,S,sols,,,1000,1.312704,49.53357
2021-1273312,2021-09-16,000001,Vente,33000,,,LA CAMPAGNE,B006,76750,76581,Saint-Germain-des-Essourts,76,,,76581000AC0295,,,,,,,,,,,,,0,,,,,T,terres,,,21347,1.334182,49.534296
2021-1273312,2021-09-16,000001,Vente,33000,,,LA CAMPAGNE,B006,76750,76581,Saint-Germain-des-Essourts,76,,,76581000AE0072,,,,,,,,,,,,,0,,,,,P,prés,,,12006,1.325254,49.537336
2021-1273312,2021-09-16,000001,Vente,33000,,,LA CAMPAGNE,B006,76750,76581,Saint-Germain-des-Essourts,76,,,76581000AE0075,,,,,,,,,,,,,0,,,,,P,prés,,,9620,1.325788,49.536324
2021-1273312,2021-09-16,000001,Vente,33000,,,LA CAMPAGNE,B006,76750,76581,Saint-Germain-des-Essourts,76,,,76581000AE0078,,,,,,,,,,,,,0,,,,,S,sols,,,27,1.326589,49.53542
2021-1273312,2021-09-16,000001,Vente,33000,,,LA CAMPAGNE,B006,76750,76581,Saint-Germain-des-Essourts,76,,,76581000AE0257,,,,,,,,,,,,,0,,,,,P,prés,,,4777,1.32661,49.535727
2021-1273312,2021-09-16,000001,Vente,33000,,,LA CAMPAGNE,B006,76750,76581,Saint-Germain-des-Essourts,76,,,76581000AE0259,,,,,,,,,,,,,0,,,,,P,prés,,,3573,1.326579,49.535322
2021-1273312,2021-09-16,000001,Vente,33000,,,LA CAMPAGNE,B006,76750,76581,Saint-Germain-des-Essourts,76,,,76581000AE0260,,,,,,,,,,,,,0,,,,,P,prés,,,63,1.32652,49.53496
2021-1273312,2021-09-16,000001,Vente,33000,,,LA CAMPAGNE,B006,76750,76581,Saint-Germain-des-Essourts,76,,,76581000AE0262,,,,,,,,,,,,,0,,,,,P,prés,,,131,1.327678,49.536044
2021-1273315,2021-07-09,000003,Echange,250,,,LA CAMPAGNE,B006,76750,76581,Saint-Germain-des-Essourts,76,,,76581000AE0256,,,,,,,,,,,,,0,,,,,P,prés,,,131,1.327232,49.535787
2021-1273315,2021-07-09,000004,Echange,250,,,LA CAMPAGNE,B006,76750,76581,Saint-Germain-des-Essourts,76,,,76581000AE0262,,,,,,,,,,,,,0,,,,,P,prés,,,131,1.327678,49.536044
2021-1273339,2021-09-30,000001,Vente,115000,5044,,LA CAMPAGNE,B006,76750,76581,Saint-Germain-des-Essourts,76,,,76581000AE0191,,,,,,,,,,,,,0,1,Maison,70,3,S,sols,,,350,1.327958,49.532658
2021-1273339,2021-09-30,000001,Vente,115000,5044,,LA CAMPAGNE,B006,76750,76581,Saint-Germain-des-Essourts,76,,,76581000AE0191,,,,,,,,,,,,,0,1,Maison,70,3,VE,vergers,,,1779,1.327958,49.532658
2021-1273558,2021-10-15,000001,Vente,20000,,,SAINT GERMAIN,B015,76750,76581,Saint-Germain-des-Essourts,76,,,76581000AE0039,,,,,,,,,,,,,0,,,,,BS,taillis sous futaie,,,1037,1.310919,49.53043
2021-1273558,2021-10-15,000001,Vente,20000,,,SAINT GERMAIN,B015,76750,76581,Saint-Germain-des-Essourts,76,,,76581000AE0040,,,,,,,,,,,,,0,,,,,P,prés,,,12800,1.310955,49.52974
2021-1273558,2021-10-15,000001,Vente,20000,,,SAINT GERMAIN,B015,76750,76581,Saint-Germain-des-Essourts,76,,,76581000AE0041,,,,,,,,,,,,,0,,,,,P,prés,,,245,1.311725,49.530659
2021-1273558,2021-10-15,000001,Vente,20000,,,SAINT GERMAIN,B015,76750,76581,Saint-Germain-des-Essourts,76,,,76581000AE0248,,,,,,,,,,,,,0,,,,,P,prés,,,11918,1.309632,49.529714
