id_mutation,date_mutation,numero_disposition,nature_mutation,valeur_fonciere,adresse_numero,adresse_suffixe,adresse_nom_voie,adresse_code_voie,code_postal,code_commune,nom_commune,code_departement,ancien_code_commune,ancien_nom_commune,id_parcelle,ancien_id_parcelle,numero_volume,lot1_numero,lot1_surface_carrez,lot2_numero,lot2_surface_carrez,lot3_numero,lot3_surface_carrez,lot4_numero,lot4_surface_carrez,lot5_numero,lot5_surface_carrez,nombre_lots,code_type_local,type_local,surface_reelle_bati,nombre_pieces_principales,code_nature_culture,nature_culture,code_nature_culture_speciale,nature_culture_speciale,surface_terrain,longitude,latitude
2021-1318255,2021-10-22,000001,Vente,45000,15,,RUE GRANDE,0020,77970,77036,Boisdon,77,,,770360000A0642,,,,,,,,,,,,,0,1,Maison,111,5,AB,terrains a bâtir,,,464,3.226858,48.684562
2021-1318255,2021-10-22,000001,Vente,45000,15,,RUE GRANDE,0020,77970,77036,Boisdon,77,,,770360000A0642,,,,,,,,,,,,,0,3,Dépendance,,0,AB,terrains a bâtir,,,464,3.226858,48.684562
2021-1318255,2021-10-22,000001,Vente,45000,15,,RUE GRANDE,0020,77970,77036,Boisdon,77,,,770360000A0643,,,,,,,,,,,,,0,,,,,S,sols,,,71,3.226724,48.684371
2021-1318255,2021-10-22,000001,Vente,45000,,,BOISDON,B001,77970,77036,Boisdon,77,,,770360000A0646,,,,,,,,,,,,,0,,,,,AB,terrains a bâtir,,,114,3.227004,48.684573
2021-1320027,2021-12-06,000001,Vente,166000,30,,RUE GRANDE,0020,77970,77036,Boisdon,77,,,770360000A0602,,,,,,,,,,,,,0,1,Maison,94,4,S,sols,,,500,3.228196,48.683628
2021-1320027,2021-12-06,000001,Vente,166000,30,,RUE GRANDE,0020,77970,77036,Boisdon,77,,,770360000A0602,,,,,,,,,,,,,0,1,Maison,94,4,J,jardins,,,314,3.228196,48.683628
2021-1320030,2021-12-02,000001,Vente,600,,,LA NOUE JEANNEAU,B012,77970,77036,Boisdon,77,,,770360000B0067,,,,,,,,,,,,,0,,,,,BT,taillis simples,,,1164,3.23022,48.666852
2021-1322027,2021-04-27,000001,Vente,185000,15,,RUE GRANDE,0020,77970,77036,Boisdon,77,,,770360000A0644,,,,,,,,,,,,,0,,,,,J,jardins,,,312,3.226825,48.684328
2021-1322027,2021-04-27,000001,Vente,185000,,,BOISDON,B001,77970,77036,Boisdon,77,,,770360000A0645,,,,,,,,,,,,,0,,,,,J,jardins,,,161,3.227069,48.684469
2021-1322027,2021-04-27,000001,Vente,185000,,,BOISDON,B001,77970,77036,Boisdon,77,,,770360000A0645,,,,,,,,,,,,,0,,,,,S,sols,,,500,3.227069,48.684469
2021-1322027,2021-04-27,000001,Vente,185000,,,BOISDON,B001,77970,77036,Boisdon,77,,,770360000A0647,,,,,,,,,,,,,0,,,,,S,sols,,,4,3.227024,48.684212
2021-1322335,2021-06-25,000001,Vente,251000,6,,RUE DES MOLINARDS,0030,77970,77036,Boisdon,77,,,770360000A0591,,,,,,,,,,,,,0,1,Maison,98,5,S,sols,,,500,3.22319,48.68566
2021-1322335,2021-06-25,000001,Vente,251000,6,,RUE DES MOLINARDS,0030,77970,77036,Boisdon,77,,,770360000A0591,,,,,,,,,,,,,0,1,Maison,98,5,J,jardins,,,329,3.22319,48.68566
2021-1322467,2021-07-27,000001,Vente,2750,,,LA NOUE JEANNEAU,B012,77970,77036,Boisdon,77,,,770360000B0066,,,,,,,,,,,,,0,,,,,BT,taillis simples,,,3923,3.230614,48.667129
