id_mutation,date_mutation,numero_disposition,nature_mutation,valeur_fonciere,adresse_numero,adresse_suffixe,adresse_nom_voie,adresse_code_voie,code_postal,code_commune,nom_commune,code_departement,ancien_code_commune,ancien_nom_commune,id_parcelle,ancien_id_parcelle,numero_volume,lot1_numero,lot1_surface_carrez,lot2_numero,lot2_surface_carrez,lot3_numero,lot3_surface_carrez,lot4_numero,lot4_surface_carrez,lot5_numero,lot5_surface_carrez,nombre_lots,code_type_local,type_local,surface_reelle_bati,nombre_pieces_principales,code_nature_culture,nature_culture,code_nature_culture_speciale,nature_culture_speciale,surface_terrain,longitude,latitude
2021-1288815,2021-01-05,000001,Vente,220200,,,DORMELLES,B049,77130,77161,Dormelles,77,,,77161000AB0168,,,,,,,,,,,,,0,,,,,J,jardins,POTAG,Jardin potager,106,2.900113,48.316066
2021-1288815,2021-01-05,000001,Vente,220200,11,,RUE ST MARTIN,0410,77130,77161,Dormelles,77,,,77161000AB0169,,,,,,,,,,,,,0,1,Maison,76,2,S,sols,,,373,2.900043,48.316314
2021-1289647,2021-02-02,000003,Vente,144,,,LE BOIS MOREAU,B021,77130,77161,Dormelles,77,,,77161000ZI0232,,,,,,,,,,,,,0,,,,,BT,taillis simples,,,574,2.89571,48.297458
2021-1290270,2021-02-22,000001,Vente,210000,4,,RTE DU GALLOIS,0260,77130,77161,Dormelles,77,,,77161000ZD0093,,,,,,,,,,,,,0,1,Maison,133,4,J,jardins,POTAG,Jardin potager,774,2.860643,48.309244
2021-1290270,2021-02-22,000001,Vente,210000,4,,RTE DU GALLOIS,0260,77130,77161,Dormelles,77,,,77161000ZD0093,,,,,,,,,,,,,0,1,Maison,133,4,S,sols,,,114,2.860643,48.309244
2021-1290270,2021-02-22,000001,Vente,210000,,,BOIS DU CHEMIN NEUF,B017,77130,77161,Dormelles,77,,,77161000ZD0142,,,,,,,,,,,,,0,,,,,BT,taillis simples,,,871,2.864329,48.307815
2021-1290270,2021-02-22,000001,Vente,210000,,,LES MERISIERS,B071,77130,77161,Dormelles,77,,,77161000ZD0247,,,,,,,,,,,,,0,,,,,AG,terrains d'agrément,PARC,Parc,330,2.860434,48.309378
2021-1290270,2021-02-22,000001,Vente,210000,,,LE PIMARD,B084,77130,77161,Dormelles,77,,,77161000ZD0248,,,,,,,,,,,,,0,,,,,AG,terrains d'agrément,PARC,Parc,627,2.860519,48.309557
2021-1290270,2021-02-22,000001,Vente,210000,,,LES MERISIERS,B071,77130,77161,Dormelles,77,,,77161000ZD0250,,,,,,,,,,,,,0,,,,,T,terres,,,277,2.860341,48.309608
2021-1290463,2021-02-26,000001,Vente,175000,16,,RUE DE LA MAIRIE,0280,77130,77161,Dormelles,77,,,77161000AB0489,,,,,,,,,,,,,0,1,Maison,60,3,S,sols,,,520,2.903267,48.31495
2021-1291386,2021-03-19,000001,Vente,5000,,,LA CAILLOUTERIE,B031,77130,77161,Dormelles,77,,,77161000ZI0357,,,,,,,,,,,,,0,,,,,BT,taillis simples,,,396,2.892126,48.294093
2021-1293129,2021-04-16,000001,Vente,45000,9,,RTE DE VILLEMARECHAL,0480,77130,77161,Dormelles,77,,,77161000AB0126,,,,,,,,,,,,,0,1,Maison,46,3,S,sols,,,44,2.899756,48.315503
2021-1293129,2021-04-16,000001,Vente,45000,,,DORMELLES,B049,77130,77161,Dormelles,77,,,77161000AB0129,,,,,,,,,,,,,0,,,,,S,sols,,,328,2.899831,48.315487
2021-1293129,2021-04-16,000001,Vente,45000,,,DORMELLES,B049,77130,77161,Dormelles,77,,,77161000AB0163,,,,,,,,,,,,,0,,,,,S,sols,,,250,2.899984,48.315843
2021-1293207,2021-04-30,000001,Vente,83000,,,EN BAS DE GUERLOT,B003,77130,77161,Dormelles,77,,,771610000B0010,,,,,,,,,,,,,0,,,,,BP,peupleraies,,,11023,2.906749,48.319118
2021-1293207,2021-04-30,000001,Vente,83000,,,EN BAS DE GUERLOT,B003,77130,77161,Dormelles,77,,,771610000B0086,,,,,,,,,,,,,0,,,,,BP,peupleraies,,,85184,2.907695,48.319362
2021-1294573,2021-05-21,000001,Vente,450271,5293,,RTE DU GALLOIS,0260,77130,77161,Dormelles,77,,,77161000ZD0128,,,,,,,,,,,,,0,3,Dépendance,,0,S,sols,,,924,2.861769,48.309378
2021-1294573,2021-05-21,000001,Vente,450271,5293,,RTE DU GALLOIS,0260,77130,77161,Dormelles,77,,,77161000ZD0128,,,,,,,,,,,,,0,1,Maison,302,6,S,sols,,,924,2.861769,48.309378
2021-1294573,2021-05-21,000001,Vente,450271,5293,,RTE DU GALLOIS,0260,77130,77161,Dormelles,77,,,77161000ZD0128,,,,,,,,,,,,,0,3,Dépendance,,0,S,sols,,,924,2.861769,48.309378
2021-1294573,2021-05-21,000001,Vente,450271,,,LE PIMARD,B084,77130,77161,Dormelles,77,,,77161000ZD0129,,,,,,,,,,,,,0,,,,,J,jardins,POTAG,Jardin potager,1551,2.861879,48.309133
2021-1294573,2021-05-21,000001,Vente,450271,,,LE PIMARD,B084,77130,77161,Dormelles,77,,,77161000ZD0130,,,,,,,,,,,,,0,,,,,BT,taillis simples,,,1034,2.862168,48.308426
2021-1294573,2021-05-21,000001,Vente,450271,,,LE PIMARD,B084,77130,77161,Dormelles,77,,,77161000ZD0131,,,,,,,,,,,,,0,,,,,BT,taillis simples,,,908,2.862328,48.308495
2021-1294573,2021-05-21,000001,Vente,450271,,,LE PIMARD,B084,77130,77161,Dormelles,77,,,77161000ZD0132,,,,,,,,,,,,,0,,,,,BT,taillis simples,,,432,2.862505,48.308403
2021-1294573,2021-05-21,000001,Vente,450271,,,LE PIMARD,B084,77130,77161,Dormelles,77,,,77161000ZD0133,,,,,,,,,,,,,0,,,,,BT,taillis simples,,,537,2.862404,48.308586
2021-1294573,2021-05-21,000001,Vente,450271,,,LE PIMARD,B084,77130,77161,Dormelles,77,,,77161000ZD0200,,,,,,,,,,,,,0,,,,,VI,vignes,,,254,2.862068,48.30909
2021-1294573,2021-05-21,000001,Vente,450271,,,LE PIMARD,B084,77130,77161,Dormelles,77,,,77161000ZD0201,,,,,,,,,,,,,0,,,,,BT,taillis simples,,,319,2.862174,48.308989
2021-1294573,2021-05-21,000001,Vente,450271,,,LE PIMARD,B084,77130,77161,Dormelles,77,,,77161000ZD0203,,,,,,,,,,,,,0,,,,,BT,taillis simples,,,362,2.862818,48.308252
2021-1294573,2021-05-21,000001,Vente,450271,,,LE PIMARD,B084,77130,77161,Dormelles,77,,,77161000ZD0205,,,,,,,,,,,,,0,,,,,BT,taillis simples,,,394,2.862619,48.308491
2021-1294573,2021-05-21,000001,Vente,450271,,,LE PIMARD,B084,77130,77161,Dormelles,77,,,77161000ZD0206,,,,,,,,,,,,,0,,,,,BT,taillis simples,,,118,2.862392,48.308898
2021-1294573,2021-05-21,000001,Vente,450271,,,LE PIMARD,B084,77130,77161,Dormelles,77,,,77161000ZD0209,,,,,,,,,,,,,0,,,,,BT,taillis simples,,,504,2.862385,48.308804
2021-1295999,2021-06-28,000001,Vente,1,7,B,RUE DU PAVE,0330,77130,77161,Dormelles,77,,,77161000AB0492,,,,,,,,,,,,,0,3,Dépendance,,0,S,sols,,,24,2.899528,48.318089
2021-1296122,2021-06-29,000001,Vente,475,,,BOIS HUARD,B019,77130,77161,Dormelles,77,,,771610000C0249,,,,,,,,,,,,,0,,,,,BT,taillis simples,,,146,2.876436,48.296635
2021-1296122,2021-06-29,000001,Vente,475,,,LES QUINCHES,B093,77130,77161,Dormelles,77,,,771610000D0122,,,,,,,,,,,,,0,,,,,BT,taillis simples,,,878,2.890759,48.315082
2021-1296122,2021-06-29,000001,Vente,475,,,LES QUINCHES,B093,77130,77161,Dormelles,77,,,771610000D0125,,,,,,,,,,,,,0,,,,,BT,taillis simples,,,878,2.890384,48.314969
2021-1296166,2021-07-13,000001,Vente,1200,2,,RUE DE LA GARENNE,0270,77130,77161,Dormelles,77,,,77161000ZD0256,,,,,,,,,,,,,0,,,,,S,sols,,,36,2.881147,48.317743
2021-1296302,2021-07-16,000001,Vente,304368,24,T,RUE DE LA MAIRIE,0280,77130,77161,Dormelles,77,,,77161000AB0396,,,,,,,,,,,,,0,1,Maison,145,5,AG,terrains d'agrément,PARC,Parc,832,2.906124,48.314568
2021-1296498,2021-07-23,000001,Vente,230750,,,LES PRES DE PILLIERS,B091,77130,77161,Dormelles,77,,,771610000F0153,,,,,,,,,,,,,0,,,,,BT,taillis simples,,,2350,2.870914,48.324709
2021-1296555,2021-07-23,000001,Vente,57,,,LA PENTE DE LA POINTE,B079,77130,77161,Dormelles,77,,,771610000D0070,,,,,,,,,,,,,0,,,,,BT,taillis simples,,,230,2.890296,48.31613
2021-1297972,2021-07-30,000001,Vente,178000,8,,RTE DE VILLE SAINT JACQUES,0440,77130,77161,Dormelles,77,,,77161000ZB0156,,,,,,,,,,,,,0,1,Maison,76,3,S,sols,,,74,2.898258,48.323293
2021-1297972,2021-07-30,000001,Vente,178000,8,,RTE DE VILLE SAINT JACQUES,0440,77130,77161,Dormelles,77,,,77161000ZB0156,,,,,,,,,,,,,0,1,Maison,76,3,J,jardins,POTAG,Jardin potager,813,2.898258,48.323293
2021-1297972,2021-07-30,000001,Vente,178000,,,LES HOPITAUX,B065,77130,77161,Dormelles,77,,,77161000ZB0257,,,,,,,,,,,,,0,,,,,BT,taillis simples,,,51,2.898635,48.323699
2021-1297972,2021-07-30,000001,Vente,178000,,,LES HOPITAUX,B065,77130,77161,Dormelles,77,,,77161000ZB0260,,,,,,,,,,,,,0,,,,,T,terres,,,401,2.898537,48.323629
2021-1298477,2021-08-17,000001,Vente,239000,,,LA VALLEE,B105,77130,77161,Dormelles,77,,,77161000ZA0189,,,,,,,,,,,,,0,,,,,S,sols,,,36,2.878975,48.324832
2021-1298477,2021-08-17,000001,Vente,239000,,,LA VALLEE,B105,77130,77161,Dormelles,77,,,77161000ZA0192,,,,,,,,,,,,,0,,,,,T,terres,,,821,2.879149,48.325154
2021-1298477,2021-08-17,000001,Vente,239000,,,LA VALLEE,B105,77130,77161,Dormelles,77,,,77161000ZA0369,,,,,,,,,,,,,0,,,,,S,sols,,,60,2.87906,48.324854
2021-1298477,2021-08-17,000001,Vente,239000,,,LA VALLEE,B105,77130,77161,Dormelles,77,,,77161000ZA0373,,,,,,,,,,,,,0,,,,,S,sols,,,492,2.879182,48.324745
2021-1299020,2021-08-28,000001,Vente,330200,47,,RUE DE LA FONTAINE CARDEE,0240,77130,77161,Dormelles,77,,,771610000D1041,,,,,,,,,,,,,0,1,Maison,151,6,S,sols,,,500,2.893148,48.317436
2021-1299020,2021-08-28,000001,Vente,330200,47,,RUE DE LA FONTAINE CARDEE,0240,77130,77161,Dormelles,77,,,771610000D1041,,,,,,,,,,,,,0,1,Maison,151,6,AG,terrains d'agrément,PARC,Parc,539,2.893148,48.317436
2021-1299255,2021-09-03,000001,Vente,335000,32,,RUE DE LA MAIRIE,0280,77130,77161,Dormelles,77,,,77161000AB0054,,,,,,,,,,,,,0,1,Maison,131,6,J,jardins,POTAG,Jardin potager,975,2.907997,48.314132
2021-1299255,2021-09-03,000001,Vente,335000,32,,RUE DE LA MAIRIE,0280,77130,77161,Dormelles,77,,,77161000AB0054,,,,,,,,,,,,,0,3,Dépendance,,0,J,jardins,POTAG,Jardin potager,975,2.907997,48.314132
2021-1299255,2021-09-03,000001,Vente,335000,32,,RUE DE LA MAIRIE,0280,77130,77161,Dormelles,77,,,77161000AB0054,,,,,,,,,,,,,0,1,Maison,131,6,S,sols,,,611,2.907997,48.314132
2021-1299255,2021-09-03,000001,Vente,335000,32,,RUE DE LA MAIRIE,0280,77130,77161,Dormelles,77,,,77161000AB0054,,,,,,,,,,,,,0,3,Dépendance,,0,S,sols,,,611,2.907997,48.314132
2021-1299355,2021-09-03,000001,Vente,5570,,,LA MALADRERIE,B067,77130,77161,Dormelles,77,,,77161000ZC0202,,,,,,,,,,,,,0,,,,,L,landes,FRICH,Friche,1114,2.905456,48.322099
2021-1299658,2021-09-16,000001,Vente,240000,78,,FONDS DE PILLIERS,B052,77130,77161,Dormelles,77,,,77161000ZA0347,,,,,,,,,,,,,0,1,Maison,92,5,S,sols,,,139,2.871456,48.327409
2021-1299658,2021-09-16,000001,Vente,240000,78,,FONDS DE PILLIERS,B052,77130,77161,Dormelles,77,,,77161000ZA0347,,,,,,,,,,,,,0,1,Maison,92,5,J,jardins,POTAG,Jardin potager,910,2.871456,48.327409
2021-1300726,2021-10-11,000001,Vente,9705,,,LA MALADRERIE,B067,77130,77161,Dormelles,77,,,77161000ZC0181,,,,,,,,,,,,,0,,,,,L,landes,FRICH,Friche,181,2.905481,48.321625
2021-1300726,2021-10-11,000001,Vente,9705,,,LA MALADRERIE,B067,77130,77161,Dormelles,77,,,77161000ZC0201,,,,,,,,,,,,,0,,,,,L,landes,FRICH,Friche,1773,2.90542,48.321778
2021-1301202,2021-10-25,000001,Vente,250,,,LA BUTTE A COLLIN,B028,77130,77161,Dormelles,77,,,771610000D0230,,,,,,,,,,,,,0,,,,,BT,taillis simples,,,590,2.892114,48.314013
2021-1301202,2021-10-25,000001,Vente,250,,,MONTAIGU,B074,77130,77161,Dormelles,77,,,771610000D0299,,,,,,,,,,,,,0,,,,,BT,taillis simples,,,525,2.895359,48.316124
2021-1301296,2021-11-05,000001,Vente,305000,,,LES PETITS PRES,B083,77130,77161,Dormelles,77,,,771610000F0698,,,,,,,,,,,,,0,,,,,BP,peupleraies,,,4030,2.895003,48.31883
2021-1301296,2021-11-05,000001,Vente,305000,38,,RUE DE LA FONTAINE CARDEE,0240,77130,77161,Dormelles,77,,,771610000F1026,,,,,,,,,,,,,0,1,Maison,86,5,S,sols,,,500,2.894671,48.317796
2021-1301296,2021-11-05,000001,Vente,305000,38,,RUE DE LA FONTAINE CARDEE,0240,77130,77161,Dormelles,77,,,771610000F1026,,,,,,,,,,,,,0,1,Maison,86,5,AG,terrains d'agrément,PARC,Parc,649,2.894671,48.317796
2021-1301296,2021-11-05,000001,Vente,305000,,,LA FONTAINE GARDEE,B053,77130,77161,Dormelles,77,,,771610000F1030,,,,,,,,,,,,,0,,,,,AG,terrains d'agrément,PARC,Parc,1145,2.894604,48.318411
2021-1301662,2021-11-05,000001,Vente,300000,9,,RTE DE VILLE SAINT JACQUES,0440,77130,77161,Dormelles,77,,,77161000ZB0269,,,,,,,,,,,,,0,1,Maison,230,8,J,jardins,POTAG,Jardin potager,1200,2.898896,48.322461
2021-1301675,2021-10-29,000001,Vente,398000,,,L AUNOY,B002,77130,77161,Dormelles,77,,,771610000F0412,,,,,,,,,,,,,0,,,,,BT,taillis simples,,,510,2.890279,48.321357
2021-1301675,2021-10-29,000001,Vente,398000,,,L AUNOY,B002,77130,77161,Dormelles,77,,,771610000F0413,,,,,,,,,,,,,0,,,,,BT,taillis simples,,,520,2.890299,48.321194
2021-1301675,2021-10-29,000001,Vente,398000,,,L AUNOY,B002,77130,77161,Dormelles,77,,,771610000F0414,,,,,,,,,,,,,0,,,,,BP,peupleraies,,,874,2.890245,48.320974
2021-1301675,2021-10-29,000001,Vente,398000,,,L AUNOY,B002,77130,77161,Dormelles,77,,,771610000F0415,,,,,,,,,,,,,0,,,,,BT,taillis simples,,,1342,2.890729,48.321152
2021-1301675,2021-10-29,000001,Vente,398000,,,L AUNOY,B002,77130,77161,Dormelles,77,,,771610000F0416,,,,,,,,,,,,,0,,,,,T,terres,,,4689,2.890864,48.322073
2021-1301675,2021-10-29,000001,Vente,398000,,,L AUNOY,B002,77130,77161,Dormelles,77,,,771610000F0417,,,,,,,,,,,,,0,,,,,J,jardins,POTAG,Jardin potager,722,2.891085,48.321707
2021-1301675,2021-10-29,000001,Vente,398000,,,LES GRANDS PRES,B059,77130,77161,Dormelles,77,,,771610000F0536,,,,,,,,,,,,,0,,,,,BP,peupleraies,,,1247,2.890854,48.320991
2021-1301675,2021-10-29,000001,Vente,398000,,,LES GRANDS PRES,B059,77130,77161,Dormelles,77,,,771610000F0537,,,,,,,,,,,,,0,,,,,BT,taillis simples,,,1760,2.8908,48.320703
2021-1301675,2021-10-29,000001,Vente,398000,,,LES GRANDS PRES,B059,77130,77161,Dormelles,77,,,771610000F0538,,,,,,,,,,,,,0,,,,,BP,peupleraies,,,960,2.890326,48.320634
2021-1301675,2021-10-29,000001,Vente,398000,11,,RUE DES MOULINS,0310,77130,77161,Dormelles,77,,,771610000F0862,,,,,,,,,,,,,0,1,Maison,147,5,S,sols,,,66,2.89116,48.322034
2021-1301675,2021-10-29,000001,Vente,398000,11,,RUE DES MOULINS,0310,77130,77161,Dormelles,77,,,771610000F0862,,,,,,,,,,,,,0,3,Dépendance,,0,S,sols,,,66,2.89116,48.322034
2021-1301675,2021-10-29,000001,Vente,398000,,,L AUNOY,B002,77130,77161,Dormelles,77,,,771610000F0910,,,,,,,,,,,,,0,,,,,S,sols,,,70,2.891268,48.322241
2021-1301675,2021-10-29,000001,Vente,398000,,,L AUNOY,B002,77130,77161,Dormelles,77,,,771610000F0911,,,,,,,,,,,,,0,,,,,S,sols,,,147,2.891193,48.322218
2021-1301675,2021-10-29,000001,Vente,398000,5163,,RUE DES MOULINS,0310,77130,77161,Dormelles,77,,,771610000F0912,,,,,,,,,,,,,0,3,Dépendance,,0,S,sols,,,102,2.891247,48.322131
2021-1301675,2021-10-29,000001,Vente,398000,5163,,RUE DES MOULINS,0310,77130,77161,Dormelles,77,,,771610000F0912,,,,,,,,,,,,,0,3,Dépendance,,0,S,sols,,,102,2.891247,48.322131
2021-1301675,2021-10-29,000001,Vente,398000,,,L AUNOY,B002,77130,77161,Dormelles,77,,,771610000F1069,,,,,,,,,,,,,0,,,,,S,sols,,,27,2.889917,48.321544
2021-1301675,2021-10-29,000001,Vente,398000,,,L AUNOY,B002,77130,77161,Dormelles,77,,,771610000F1070,,,,,,,,,,,,,0,,,,,AG,terrains d'agrément,PARC,Parc,1062,2.889891,48.321179
2021-1302026,2021-11-30,000001,Vente,247000,54,,RUE DE LA FONTAINE CARDEE,0240,77130,77161,Dormelles,77,,,771610000F0824,,,,,,,,,,,,,0,1,Maison,99,5,S,sols,,,880,2.891875,48.318159
2021-1302026,2021-11-30,000001,Vente,247000,54,,RUE DE LA FONTAINE CARDEE,0240,77130,77161,Dormelles,77,,,771610000F0824,,,,,,,,,,,,,0,1,Maison,99,5,J,jardins,POTAG,Jardin potager,1720,2.891875,48.318159
2021-1302273,2021-11-09,000001,Vente,375188.16,9,,RTE DE VILLE SAINT JACQUES,0440,77130,77161,Dormelles,77,,,77161000ZB0269,,,,,,,,,,,,,0,1,Maison,230,8,J,jardins,POTAG,Jardin potager,1200,2.898896,48.322461
2021-1302325,2021-12-03,000001,Vente,333000,5,,RTE DE LA MALADRERIE,0290,77130,77161,Dormelles,77,,,77161000ZB0233,,,,,,,,,,,,,0,1,Maison,152,6,J,jardins,POTAG,Jardin potager,1922,2.90089,48.322436
2021-1302325,2021-12-03,000001,Vente,333000,5,,RTE DE LA MALADRERIE,0290,77130,77161,Dormelles,77,,,77161000ZB0233,,,,,,,,,,,,,0,1,Maison,152,6,S,sols,,,500,2.90089,48.322436
2021-1302565,2021-12-01,000001,Vente,55000,,,SAINT GERVAIS,B100,77130,77161,Dormelles,77,,,771610000F0669,,,,,,,,,,,,,0,,,,,J,jardins,POTAG,Jardin potager,237,2.897191,48.318116
2021-1302565,2021-12-01,000001,Vente,55000,,,SAINT GERVAIS,B100,77130,77161,Dormelles,77,,,771610000F0670,,,,,,,,,,,,,0,,,,,J,jardins,POTAG,Jardin potager,411,2.896967,48.318083
2021-1302565,2021-12-01,000001,Vente,55000,,,SAINT GERVAIS,B100,77130,77161,Dormelles,77,,,771610000F1011,,,,,,,,,,,,,0,,,,,VE,vergers,,,253,2.896906,48.318268
2021-1302966,2021-12-13,000001,Vente,2100,,,MONTAIGU,B074,77130,77161,Dormelles,77,,,771610000D0311,,,,,,,,,,,,,0,,,,,BT,taillis simples,,,958,2.895349,48.316555
2021-1302966,2021-12-13,000001,Vente,2100,,,LA BUTTE A COLLIN,B028,77130,77161,Dormelles,77,,,771610000D0939,,,,,,,,,,,,,0,,,,,BT,taillis simples,,,460,2.890402,48.314104
2021-1302966,2021-12-13,000001,Vente,2100,,,LES PETITS PRES,B083,77130,77161,Dormelles,77,,,771610000F0703,,,,,,,,,,,,,0,,,,,BP,peupleraies,,,120,2.894244,48.318939
2021-1302966,2021-12-13,000001,Vente,2100,,,LE BELVEDERE,B006,77130,77161,Dormelles,77,,,77161000ZA0314,,,,,,,,,,,,,0,,,,,BT,taillis simples,,,416,2.883997,48.329887
2021-1302966,2021-12-13,000001,Vente,2100,,,LA MARE DU MITAIS,B070,77130,77161,Dormelles,77,,,77161000ZI0096,,,,,,,,,,,,,0,,,,,BT,taillis simples,,,560,2.885999,48.293451
2021-1302966,2021-12-13,000001,Vente,2100,,,LA CAILLOUTERIE,B031,77130,77161,Dormelles,77,,,77161000ZI0370,,,,,,,,,,,,,0,,,,,BT,taillis simples,,,551,2.892282,48.292767
2021-1303116,2021-12-10,000001,Vente,260000,1,,RTE DE DORMELLES,0210,77130,77161,Dormelles,77,,,77161000ZB0034,,,,,,,,,,,,,0,1,Maison,70,4,S,sols,,,512,2.897636,48.322291
2021-1303116,2021-12-10,000001,Vente,260000,1,,RTE DE DORMELLES,0210,77130,77161,Dormelles,77,,,77161000ZB0034,,,,,,,,,,,,,0,1,Maison,70,4,T,terres,,,2737,2.897636,48.322291
2021-1303299,2021-12-17,000001,Vente,110000,,,L AUNOY,B002,77130,77161,Dormelles,77,,,771610000F1065,,,,,,,,,,,,,0,,,,,S,sols,,,21,2.890358,48.322376
2021-1303299,2021-12-17,000001,Vente,110000,,,L AUNOY,B002,77130,77161,Dormelles,77,,,771610000F1066,,,,,,,,,,,,,0,,,,,VE,vergers,,,841,2.890234,48.322074
2021-1303299,2021-12-17,000001,Vente,110000,,,L AUNOY,B002,77130,77161,Dormelles,77,,,771610000F1067,,,,,,,,,,,,,0,,,,,S,sols,,,17,2.890615,48.322375
2021-1303299,2021-12-17,000001,Vente,110000,,,L AUNOY,B002,77130,77161,Dormelles,77,,,771610000F1068,,,,,,,,,,,,,0,,,,,T,terres,,,1317,2.890371,48.321908
2021-1303299,2021-12-17,000001,Vente,110000,,,L AUNOY,B002,77130,77161,Dormelles,77,,,771610000F1069,,,,,,,,,,,,,0,,,,,S,sols,,,27,2.889917,48.321544
2021-1303299,2021-12-17,000001,Vente,110000,,,RUE DES MOULINS,0310,77130,77161,Dormelles,77,,,771610000F1071,,,,,,,,,,,,,0,,,,,S,sols,,,3,2.890505,48.322373
2021-1303299,2021-12-17,000001,Vente,110000,,,RUE DES MOULINS,0310,77130,77161,Dormelles,77,,,771610000F1072,,,,,,,,,,,,,0,,,,,S,sols,,,197,2.890293,48.321921
2021-1303299,2021-12-17,000001,Vente,110000,,,L AUNOY,B002,77130,77161,Dormelles,77,,,771610000F1073,,,,,,,,,,,,,0,,,,,BP,peupleraies,,,239,2.890142,48.321648
2021-1303299,2021-12-17,000001,Vente,110000,,,L AUNOY,B002,77130,77161,Dormelles,77,,,771610000F1074,,,,,,,,,,,,,0,,,,,BT,taillis simples,,,488,2.890048,48.321717
2021-1303577,2021-12-22,000001,Vente,10000,,,DORMELLES,B049,77130,77161,Dormelles,77,,,77161000AB0412,,,,,,,,,,,,,0,,,,,AG,terrains d'agrément,PARC,Parc,62,2.901451,48.315042
2021-1303577,2021-12-22,000001,Vente,10000,,,DORMELLES,B049,77130,77161,Dormelles,77,,,77161000AB0415,,,,,,,,,,,,,0,,,,,AG,terrains d'agrément,PARC,Parc,515,2.901669,48.314998
2021-1303713,2021-12-23,000001,Vente,292000,7,,RTE DE LA MALADRERIE,0290,77130,77161,Dormelles,77,,,77161000ZB0234,,,,,,,,,,,,,0,1,Maison,55,3,J,jardins,POTAG,Jardin potager,2021,2.901194,48.322355
2021-1303713,2021-12-23,000001,Vente,292000,7,,RTE DE LA MALADRERIE,0290,77130,77161,Dormelles,77,,,77161000ZB0234,,,,,,,,,,,,,0,1,Maison,55,3,S,sols,,,416,2.901194,48.322355
