id_mutation,date_mutation,numero_disposition,nature_mutation,valeur_fonciere,adresse_numero,adresse_suffixe,adresse_nom_voie,adresse_code_voie,code_postal,code_commune,nom_commune,code_departement,ancien_code_commune,ancien_nom_commune,id_parcelle,ancien_id_parcelle,numero_volume,lot1_numero,lot1_surface_carrez,lot2_numero,lot2_surface_carrez,lot3_numero,lot3_surface_carrez,lot4_numero,lot4_surface_carrez,lot5_numero,lot5_surface_carrez,nombre_lots,code_type_local,type_local,surface_reelle_bati,nombre_pieces_principales,code_nature_culture,nature_culture,code_nature_culture_speciale,nature_culture_speciale,surface_terrain,longitude,latitude
2021-1326099,2021-04-02,000001,Vente,208000,2,,RUE CHARLES ROBERT,0160,78440,78267,Gargenville,78,,,78267000AK0234,,,2,79.75,,,,,,,,,1,1,Maison,60,5,AG,terrains d'agrément,JARD,Jardin d'agrément,127,1.810155,48.983823
2021-1326779,2021-04-29,000001,Vente,237000,4,,RUE MARCELLE CHAUSSON,1160,78440,78267,Gargenville,78,,,78267000AH0059,,,,,,,,,,,,,0,3,Dépendance,,0,S,sols,,,517,1.811084,48.981279
2021-1326779,2021-04-29,000001,Vente,237000,4,,RUE MARCELLE CHAUSSON,1160,78440,78267,Gargenville,78,,,78267000AH0059,,,,,,,,,,,,,0,1,Maison,102,4,S,sols,,,517,1.811084,48.981279
2021-1326779,2021-04-29,000001,Vente,237000,4,,RUE MARCELLE CHAUSSON,1160,78440,78267,Gargenville,78,,,78267000AH0059,,,,,,,,,,,,,0,3,Dépendance,,0,S,sols,,,517,1.811084,48.981279
2021-1327100,2021-04-26,000001,Vente,41442.82,,,RUE DES GROUETTES,0740,78440,78267,Gargenville,78,,,78267000AP0483,,,,,,,,,,,,,0,,,,,T,terres,,,542,,
2021-1327142,2021-04-26,000001,Vente,73557.18,,,RUE DES GROUETTES,0740,78440,78267,Gargenville,78,,,78267000AP0484,,,,,,,,,,,,,0,,,,,T,terres,,,962,,
2021-1327143,2021-05-05,000001,Vente,236000,,,AV LUCIE DESNOS,1120,78440,78267,Gargenville,78,,,78267000AK0218,,,,,,,,,,,,,0,,,,,S,sols,,,12,1.810639,48.984542
2021-1327143,2021-05-05,000001,Vente,236000,18,,AV LUCIE DESNOS,1120,78440,78267,Gargenville,78,,,78267000AK0219,,,,,,,,,,,,,0,1,Maison,73,3,S,sols,,,206,1.810741,48.984519
2021-1327192,2021-04-30,000001,Vente,160000,3,,RUE D HANNEUCOURT,0835,78440,78267,Gargenville,78,,,78267000AM0415,,,49,53.8,6,,,,,,,,2,2,Appartement,53,3,,,,,,1.818411,48.989151
2021-1327192,2021-04-30,000001,Vente,160000,3,,RUE D HANNEUCOURT,0835,78440,78267,Gargenville,78,,,78267000AM0415,,,127,,,,,,,,,,1,3,Dépendance,,0,,,,,,1.818411,48.989151
2021-1327843,2021-04-26,000001,Vente,383300,15,B,RUE DE VERDUN,1480,78440,78267,Gargenville,78,,,78267000AR0154,,,,,,,,,,,,,0,1,Maison,131,6,J,jardins,POTAG,Jardin potager,275,1.808713,48.99447
2021-1327843,2021-04-26,000001,Vente,383300,15,B,RUE DE VERDUN,1480,78440,78267,Gargenville,78,,,78267000AR0154,,,,,,,,,,,,,0,1,Maison,131,6,S,sols,,,500,1.808713,48.99447
2021-1327911,2021-05-11,000001,Vente,400000,17,,RUE CHARLES LEVIEIL,0120,78440,78267,Gargenville,78,,,78267000AN0258,,,,,,,,,,,,,0,1,Maison,185,6,AG,terrains d'agrément,PARC,Parc,1108,1.826136,48.994117
2021-1327911,2021-05-11,000001,Vente,400000,17,,RUE CHARLES LEVIEIL,0120,78440,78267,Gargenville,78,,,78267000AN0258,,,,,,,,,,,,,0,1,Maison,185,6,S,sols,,,500,1.826136,48.994117
2021-1327911,2021-05-11,000001,Vente,400000,17,,RUE CHARLES LEVIEIL,0120,78440,78267,Gargenville,78,,,78267000AN0259,,,,,,,,,,,,,0,,,,,S,sols,,,2069,1.82609,48.994043
2021-1328130,2021-05-22,000002,Echange,5000,20,,AV JEAN JAURES,0940,78440,78267,Gargenville,78,,,78267000AS0162,,,,,,,,,,,,,0,,,,,S,sols,,,39,1.804274,48.975402
2021-1328130,2021-05-22,000003,Echange,5000,20,,AV JEAN JAURES,0940,78440,78267,Gargenville,78,,,78267000AS0160,,,,,,,,,,,,,0,,,,,S,sols,,,156,1.804437,48.975245
2021-1328358,2021-05-11,000001,Vente,242500,2,,RUE DES COURLIS,0290,78440,78267,Gargenville,78,,,78267000AK0012,,,44,,,,,,,,,,1,1,Maison,72,4,S,sols,,,278,1.811721,48.987064
2021-1328453,2021-05-05,000001,Vente,435000,8,,RUE GEORGES CLEMENCEAU,0680,78440,78267,Gargenville,78,,,78267000AN0036,,,,,,,,,,,,,0,1,Maison,80,6,S,sols,,,439,1.824807,48.993651
2021-1328453,2021-05-05,000001,Vente,435000,8,,RUE GEORGES CLEMENCEAU,0680,78440,78267,Gargenville,78,,,78267000AN0036,,,,,,,,,,,,,0,3,Dépendance,,0,S,sols,,,439,1.824807,48.993651
2021-1328502,2021-05-04,000001,Vente,288000,48,,AV LUCIE DESNOS,1120,78440,78267,Gargenville,78,,,78267000AK0363,,1,,,,,,,,,,,0,,,,,,,,,,1.810629,48.986173
2021-1328502,2021-05-04,000001,Vente,288000,48,,AV LUCIE DESNOS,1120,78440,78267,Gargenville,78,,,78267000AK0364,,,,,,,,,,,,,0,3,Dépendance,,0,S,sols,,,211,1.810897,48.986173
2021-1328502,2021-05-04,000001,Vente,288000,48,,AV LUCIE DESNOS,1120,78440,78267,Gargenville,78,,,78267000AK0365,,,,,,,,,,,,,0,,,,,S,sols,,,242,1.810761,48.986177
2021-1328508,2021-05-07,000001,Vente,300000,64,,RUE GABRIEL PERI,0580,78440,78267,Gargenville,78,,,78267000AH0178,,,,,,,,,,,,,0,1,Maison,90,4,S,sols,,,253,1.81119,48.982624
2021-1328943,2021-05-12,000001,Vente en l'état futur d'achèvement,189000,1,,RUE BERNARD PALISSY,0060,78440,78267,Gargenville,78,,,78267000AD0204,,,53,,,,,,,,,,1,2,Appartement,58,3,,,,,,1.809811,48.981652
2021-1328943,2021-05-12,000001,Vente en l'état futur d'achèvement,189000,1,,RUE BERNARD PALISSY,0060,78440,78267,Gargenville,78,,,78267000AD0204,,,97,,,,,,,,,,1,3,Dépendance,,0,,,,,,1.809811,48.981652
2021-1329034,2021-05-14,000001,Vente en l'état futur d'achèvement,211150,1,,RUE BERNARD PALISSY,0060,78440,78267,Gargenville,78,,,78267000AD0204,,,39,,,,,,,,,,1,2,Appartement,63,3,,,,,,1.809811,48.981652
2021-1329034,2021-05-14,000001,Vente en l'état futur d'achèvement,211150,1,,RUE BERNARD PALISSY,0060,78440,78267,Gargenville,78,,,78267000AD0204,,,91,,,,,,,,,,1,3,Dépendance,,0,,,,,,1.809811,48.981652
2021-1329086,2021-05-19,000001,Vente,230000,76,,AV DE PARIS,1270,78440,78267,Gargenville,78,,,78267000AM0324,,,,,,,,,,,,,0,3,Dépendance,,0,S,sols,,,431,1.815488,48.988383
2021-1329086,2021-05-19,000001,Vente,230000,76,,AV DE PARIS,1270,78440,78267,Gargenville,78,,,78267000AM0324,,,,,,,,,,,,,0,1,Maison,73,4,S,sols,,,431,1.815488,48.988383
2021-1329093,2021-05-20,000001,Vente,249500,29,,RUE DE LA CERAMIQUE,0100,78440,78267,Gargenville,78,,,78267000AD0071,,,,,,,,,,,,,0,1,Maison,25,2,S,sols,,,574,1.806063,48.978962
2021-1329093,2021-05-20,000001,Vente,249500,29,,RUE DE LA CERAMIQUE,0100,78440,78267,Gargenville,78,,,78267000AD0071,,,,,,,,,,,,,0,1,Maison,88,4,S,sols,,,574,1.806063,48.978962
2021-1329868,2021-05-22,000001,Vente,315000,18,,RUE CHARLES LEVIEIL,0120,78440,78267,Gargenville,78,,,78267000AO0087,,,,,,,,,,,,,0,1,Maison,65,3,S,sols,,,400,1.824774,48.994181
2021-1329868,2021-05-22,000001,Vente,315000,18,,RUE CHARLES LEVIEIL,0120,78440,78267,Gargenville,78,,,78267000AO0087,,,,,,,,,,,,,0,1,Maison,110,5,S,sols,,,400,1.824774,48.994181
2021-1330457,2021-06-09,000002,Vente,1,9,B,RUE DES SABLONS,1444,78440,78267,Gargenville,78,,,78267000ZD0902,,,,,,,,,,,,,0,,,,,S,sols,,,19,1.806656,48.990785
2021-1330463,2021-06-07,000001,Vente,258000,59,,RUE DES ERABLES,0435,78440,78267,Gargenville,78,,,78267000AK0209,,,,,,,,,,,,,0,1,Maison,88,5,S,sols,,,554,1.81538,48.985342
2021-1330561,2021-06-03,000001,Vente,800000,12,,RUE DES LONGUES RAIES,1113,78440,78267,Gargenville,78,,,78267000AD0198,,,,,,,,,,,,,0,4,Local industriel. commercial ou assimilé,1416,0,S,sols,,,3138,1.804045,48.978301
2021-1330766,2021-06-14,000001,Vente,236000,12,,RUE DES CAMPANULES,0095,78440,78267,Gargenville,78,,,78267000AK0041,,,,,,,,,,,,,0,1,Maison,74,4,S,sols,,,466,1.811478,48.985043
2021-1330822,2021-06-11,000001,Vente,418500,,,RUE DES BOUVRESSES,0090,78440,78267,Gargenville,78,,,78267000AC0051,,,,,,,,,,,,,0,,,,,S,sols,,,702,1.808577,48.977378
2021-1330822,2021-06-11,000001,Vente,418500,26,,RUE DES BOUVRESSES,0090,78440,78267,Gargenville,78,,,78267000AC0052,,,,,,,,,,,,,0,1,Maison,109,6,AG,terrains d'agrément,JARD,Jardin d'agrément,234,1.808373,48.977343
2021-1330822,2021-06-11,000001,Vente,418500,26,,RUE DES BOUVRESSES,0090,78440,78267,Gargenville,78,,,78267000AC0052,,,,,,,,,,,,,0,1,Maison,109,6,S,sols,,,500,1.808373,48.977343
2021-1330940,2021-06-11,000001,Vente en l'état futur d'achèvement,208060,1,,RUE BERNARD PALISSY,0060,78440,78267,Gargenville,78,,,78267000AD0204,,,95,,,,,,,,,,1,3,Dépendance,,0,,,,,,1.809811,48.981652
2021-1330940,2021-06-11,000001,Vente en l'état futur d'achèvement,208060,1,,RUE BERNARD PALISSY,0060,78440,78267,Gargenville,78,,,78267000AD0204,,,43,,,,,,,,,,1,2,Appartement,64,2,,,,,,1.809811,48.981652
2021-1330955,2021-06-18,000001,Vente,32000,56,B,AV DU COLONEL FABIEN,0220,78440,78267,Gargenville,78,,,78267000ZD0791,,,,,,,,,,,,,0,,,,,S,sols,,,531,1.804135,48.988259
2021-1331191,2021-06-09,000001,Vente,348306.25,,,RUE DES LONGUES RAIES,1113,78440,78267,Gargenville,78,,,78267000AD0280,,,,,,,,,,,,,0,,,,,AB,terrains a bâtir,,,7257,1.801949,48.977467
2021-1331191,2021-06-09,000001,Vente,348306.25,,,RUE DES LONGUES RAIES,1113,78440,78267,Gargenville,78,,,78267000AD0283,,,,,,,,,,,,,0,,,,,AB,terrains a bâtir,,,4906,1.802797,48.977738
2021-1331191,2021-06-09,000001,Vente,348306.25,,,RUE DES LONGUES RAIES,1113,78440,78267,Gargenville,78,,,78267000AD0287,,,,,,,,,,,,,0,,,,,AB,terrains a bâtir,,,1973,1.803334,48.977924
2021-1331726,2021-07-02,000001,Vente,222000,39,,RUE PASTEUR,1260,78440,78267,Gargenville,78,,,78267000AL0070,,,,,,,,,,,,,0,1,Maison,56,3,AG,terrains d'agrément,JARD,Jardin d'agrément,498,1.807108,48.984839
2021-1331726,2021-07-02,000001,Vente,222000,39,,RUE PASTEUR,1260,78440,78267,Gargenville,78,,,78267000AL0070,,,,,,,,,,,,,0,1,Maison,56,3,S,sols,,,500,1.807108,48.984839
2021-1331750,2021-06-16,000001,Vente,92000,54,,RUE DANIELE CASANOVA,0360,78440,78267,Gargenville,78,,,78267000AP0282,,,8,,,,,,,,,,1,2,Appartement,29,2,,,,,,1.811722,48.991841
2021-1332082,2021-07-02,000002,Vente,27071.74,,,AV DE PARIS,1270,78440,78267,Gargenville,78,,,78267000AI0025,,,,,,,,,,,,,0,,,,,S,sols,,,40,1.821182,48.986964
2021-1332160,2021-07-05,000001,Vente,286000,8,,RUE DU DOCTEUR SCHWEITZER,0400,78440,78267,Gargenville,78,,,78267000AC0021,,,,,,,,,,,,,0,1,Maison,84,5,S,sols,,,488,1.809782,48.978676
2021-1332221,2021-06-30,000001,Vente,298650,12,,RUE CHARLES ROBERT,0160,78440,78267,Gargenville,78,,,78267000AK0372,,,,,,,,,,,,,0,1,Maison,114,5,S,sols,,,669,1.807547,48.983738
2021-1332663,2021-06-29,000001,Vente,260000,10,,RUE DES GATS,0673,78440,78267,Gargenville,78,,,78267000AR0034,,,,,,,,,,,,,0,3,Dépendance,,0,S,sols,,,495,1.801079,48.992709
2021-1332663,2021-06-29,000001,Vente,260000,10,,RUE DES GATS,0673,78440,78267,Gargenville,78,,,78267000AR0034,,,,,,,,,,,,,0,1,Maison,80,4,S,sols,,,495,1.801079,48.992709
2021-1332812,2021-06-25,000001,Vente,224442,4,,RUE DU DOLINGEN,0419,78440,78267,Gargenville,78,,,78267000AP0515,,,20,,25,,37,80.16,42,,,,4,3,Dépendance,,0,,,,,,1.820533,48.993511
2021-1332812,2021-06-25,000001,Vente,224442,4,,RUE DU DOLINGEN,0419,78440,78267,Gargenville,78,,,78267000AP0515,,,20,,25,,37,80.16,42,,,,4,2,Appartement,79,4,,,,,,1.820533,48.993511
2021-1332812,2021-06-25,000001,Vente,224442,4,,RUE DU DOLINGEN,0419,78440,78267,Gargenville,78,,,78267000AP0515,,,20,,25,,37,80.16,42,,,,4,3,Dépendance,,0,,,,,,1.820533,48.993511
2021-1332812,2021-06-25,000001,Vente,224442,4,,RUE DU DOLINGEN,0419,78440,78267,Gargenville,78,,,78267000AP0515,,,20,,25,,37,80.16,42,,,,4,3,Dépendance,,0,,,,,,1.820533,48.993511
2021-1332987,2021-07-02,000001,Vente,240000,12,,RUE DANIELE CASANOVA,0360,78440,78267,Gargenville,78,,,78267000AP0176,,,4,,,,,,,,,,1,,,,,J,jardins,POTAG,Jardin potager,80,1.817852,48.992385
2021-1332987,2021-07-02,000001,Vente,240000,12,,RUE DANIELE CASANOVA,0360,78440,78267,Gargenville,78,,,78267000AP0176,,,2,81.79,,,,,,,,,1,1,Maison,82,5,S,sols,,,298,1.817852,48.992385
2021-1332987,2021-07-02,000001,Vente,240000,12,,RUE DANIELE CASANOVA,0360,78440,78267,Gargenville,78,,,78267000AP0176,,,5,,,,,,,,,,1,3,Dépendance,,0,S,sols,,,53,1.817852,48.992385
2021-1333070,2021-07-01,000001,Vente,223000,8,,RUE DES CAMPANULES,0095,78440,78267,Gargenville,78,,,78267000AK0012,,,54,71.63,,,,,,,,,1,1,Maison,76,4,S,sols,,,209,1.811721,48.987064
2021-1333079,2021-07-05,000001,Vente,357000,21,,RUE DES GROUX,0720,78440,78267,Gargenville,78,,,78267000AP0158,,,,,,,,,,,,,0,1,Maison,150,5,S,sols,,,754,1.818361,48.993865
2021-1333079,2021-07-05,000001,Vente,357000,,,RUE DES GROUX,0720,78440,78267,Gargenville,78,,,78267000AP0160,,,,,,,,,,,,,0,,,,,T,terres,,,188,1.818185,48.993787
2021-1333129,2021-07-09,000001,Vente,180000,54,,RUE DANIELE CASANOVA,0360,78440,78267,Gargenville,78,,,78267000AP0282,,,13,,,,,,,,,,1,3,Dépendance,,0,,,,,,1.811722,48.991841
2021-1333129,2021-07-09,000001,Vente,180000,54,,RUE DANIELE CASANOVA,0360,78440,78267,Gargenville,78,,,78267000AP0282,,,10,,,,,,,,,,1,2,Appartement,63,4,,,,,,1.811722,48.991841
2021-1333129,2021-07-09,000001,Vente,180000,54,,RUE DANIELE CASANOVA,0360,78440,78267,Gargenville,78,,,78267000AP0282,,,14,,,,,,,,,,1,3,Dépendance,,0,,,,,,1.811722,48.991841
2021-1333595,2021-07-13,000001,Vente,309500,10,,IMP HELENE BOUCHER,0850,78440,78267,Gargenville,78,,,78267000AD0238,,,,,,,,,,,,,0,1,Maison,104,5,S,sols,,,231,1.805628,48.978917
2021-1333677,2021-07-07,000001,Vente,375000,10,,IMP FRANCOIS RABELAIS,0516,78440,78267,Gargenville,78,,,78267000AL0017,,,,,,,,,,,,,0,1,Maison,123,6,S,sols,,,516,1.807805,48.987651
2021-1333733,2021-06-29,000001,Vente,290000,21,,RUE JEAN MERMOZ,0960,78440,78267,Gargenville,78,,,78267000AC0166,,,,,,,,,,,,,0,1,Maison,74,4,S,sols,,,500,1.810396,48.977925
2021-1333733,2021-06-29,000001,Vente,290000,21,,RUE JEAN MERMOZ,0960,78440,78267,Gargenville,78,,,78267000AC0166,,,,,,,,,,,,,0,1,Maison,74,4,AG,terrains d'agrément,JARD,Jardin d'agrément,345,1.810396,48.977925
2021-1333741,2021-07-09,000001,Vente,250000,7,,RUE DU DOLINGEN,0419,78440,78267,Gargenville,78,,,78267000AP0453,,,,,,,,,,,,,0,1,Maison,77,4,S,sols,,,147,1.820758,48.993062
2021-1333745,2021-07-09,000001,Vente,85000,2,,RUE DU LAVOIR,1060,78440,78267,Gargenville,78,,,78267000AO0080,,,,,,,,,,,,,0,1,Maison,74,3,S,sols,,,117,1.825665,48.994718
2021-1333745,2021-07-09,000001,Vente,85000,2,,RUE DU LAVOIR,1060,78440,78267,Gargenville,78,,,78267000AO0080,,,,,,,,,,,,,0,3,Dépendance,,0,S,sols,,,117,1.825665,48.994718
2021-1333747,2021-07-08,000001,Vente,5000,,,LES GRANDS JARDINS,B036,78440,78267,Gargenville,78,,,78267000AN0085,,,,,,,,,,,,,0,,,,,T,terres,,,210,1.826287,48.990764
2021-1333904,2021-07-13,000001,Vente,310000,8,,RUE EMILE ZOLA,0430,78440,78267,Gargenville,78,,,78267000ZD0511,,,,,,,,,,,,,0,1,Maison,92,3,S,sols,,,457,1.808072,48.990536
2021-1333904,2021-07-13,000001,Vente,310000,,,LES COUTURES,B019,78440,78267,Gargenville,78,,,78267000ZD0522,,,,,,,,,,,,,0,,,,,S,sols,,,3404,1.80805,48.989903
2021-1333904,2021-07-13,000001,Vente,310000,15,,RUE VOLTAIRE,1530,78440,78267,Gargenville,78,,,78267000ZD0525,,,,,,,,,,,,,0,,,,,S,sols,,,53,1.808271,48.989638
2021-1334007,2021-07-26,000001,Vente,83000,3,,RUE D HANNEUCOURT,0835,78440,78267,Gargenville,78,,,78267000AM0415,,,62,,80,26.54,,,,,,,2,3,Dépendance,,0,,,,,,1.818411,48.989151
2021-1334007,2021-07-26,000001,Vente,83000,3,,RUE D HANNEUCOURT,0835,78440,78267,Gargenville,78,,,78267000AM0415,,,62,,80,26.54,,,,,,,2,2,Appartement,25,1,,,,,,1.818411,48.989151
2021-1334007,2021-07-26,000001,Vente,83000,3,,RUE D HANNEUCOURT,0835,78440,78267,Gargenville,78,,,78267000AM0415,,,105,,,,,,,,,,1,3,Dépendance,,0,,,,,,1.818411,48.989151
2021-1334030,2021-07-12,000001,Vente,237150,16,,RUE DES ANEMONES,0050,78440,78267,Gargenville,78,,,78267000AK0012,,,128,,,,,,,,,,1,1,Maison,73,4,S,sols,,,289,1.811721,48.987064
2021-1334318,2021-07-16,000002,Vente,95000,,,RUE PIERRE BROSSOLETTE,1300,78440,78267,Gargenville,78,,,78267000AC0203,,,,,,,,,,,,,0,,,,,AB,terrains a bâtir,,,250,1.811476,48.977786
2021-1334575,2021-07-09,000001,Vente,335000,2,,IMP DE LA PORTE AUX CHAMPS,1339,78440,78267,Gargenville,78,,,78267000AN0231,,,,,,,,,,,,,0,1,Maison,120,5,S,sols,,,418,1.825133,48.991183
2021-1334774,2021-07-23,000001,Vente,200000,17,,RUE GAMBETTA,0620,78440,78267,Gargenville,78,,,78267000AM0463,,,,,,,,,,,,,0,1,Maison,102,4,S,sols,,,69,1.812224,48.99076
2021-1334774,2021-07-23,000001,Vente,200000,17,,RUE GAMBETTA,0620,78440,78267,Gargenville,78,,,78267000AM0464,,,,,,,,,,,,,0,,,,,S,sols,,,72,1.812227,48.990707
2021-1335097,2021-07-30,000001,Vente,205600,8,,RUE DU LAVOIR,1060,78440,78267,Gargenville,78,,,78267000AO0078,,,,,,,,,,,,,0,1,Maison,109,4,S,sols,,,160,1.825315,48.99464
2021-1335173,2021-07-29,000001,Vente,377000,23,,AV JEAN JAURES,0940,78440,78267,Gargenville,78,,,78267000AS0085,,,,,,,,,,,,,0,1,Maison,120,5,S,sols,,,426,1.804743,48.97448
2021-1335173,2021-07-29,000001,Vente,377000,,,AV JEAN JAURES,0940,78440,78267,Gargenville,78,,,78267000AS0086,,,,,,,,,,,,,0,,,,,S,sols,,,369,1.804806,48.974512
2021-1335232,2021-07-30,000001,Vente,295000,15,,RUE DES CHENES,0167,78440,78267,Gargenville,78,,,78267000AK0109,,,,,,,,,,,,,0,1,Maison,88,5,S,sols,,,562,1.814601,48.986725
2021-1335292,2021-07-16,000001,Vente,254000,2,,IMP BLERIOT,0067,78440,78267,Gargenville,78,,,78267000ZD0674,,,,,,,,,,,,,0,1,Maison,87,4,S,sols,,,521,1.802448,48.991311
2021-1335292,2021-07-16,000001,Vente,254000,2,,IMP BLERIOT,0067,78440,78267,Gargenville,78,,,78267000ZD0674,,,,,,,,,,,,,0,3,Dépendance,,0,S,sols,,,521,1.802448,48.991311
2021-1335406,2021-07-13,000001,Vente,212000,20,,RUE JEAN MOULIN,0980,78440,78267,Gargenville,78,,,78267000AR0208,,,,,,,,,,,,,0,1,Maison,72,4,S,sols,,,284,1.809066,48.99195
2021-1335498,2021-07-29,000001,Vente,269022,9,,ALL DES NOISETIERS,1254,78440,78267,Gargenville,78,,,78267000AK0359,,,,,,,,,,,,,0,1,Maison,100,6,S,sols,,,347,1.814513,48.98632
2021-1335867,2021-07-19,000001,Vente,232000,8,,RUE JEAN MOULIN,0980,78440,78267,Gargenville,78,,,78267000AR0202,,,,,,,,,,,,,0,1,Maison,72,4,S,sols,,,276,1.809757,48.991815
2021-1335879,2021-07-22,000001,Vente,110750,40,,RUE DANIELE CASANOVA,0360,78440,78267,Gargenville,78,,,78267000AP0274,,,14,,,,,,,,,,1,3,Dépendance,,0,,,,,,1.813318,48.991835
2021-1335879,2021-07-22,000001,Vente,110750,40,,RUE DANIELE CASANOVA,0360,78440,78267,Gargenville,78,,,78267000AP0274,,,8,30.43,9,,,,,,,,2,2,Appartement,35,1,,,,,,1.813318,48.991835
2021-1335879,2021-07-22,000001,Vente,110750,40,,RUE DANIELE CASANOVA,0360,78440,78267,Gargenville,78,,,78267000AP0274,,,8,30.43,9,,,,,,,,2,3,Dépendance,,0,,,,,,1.813318,48.991835
2021-1336280,2021-08-06,000001,Vente,100000,3,,RUE JULIE THOUROUT,1020,78440,78267,Gargenville,78,,,78267000AR0279,,,,,,,,,,,,,0,1,Maison,49,2,S,sols,,,148,1.809843,48.99353
2021-1336737,2021-07-26,000001,Vente,223000,20,,RUE DES MERLETTES,1210,78440,78267,Gargenville,78,,,78267000AK0012,,,111,88,,,,,,,,,1,1,Maison,90,5,S,sols,,,273,1.811721,48.987064
2021-1336753,2021-07-27,000001,Vente,476450,55,,RUE DE L ILE DE FRANCE,0880,78440,78267,Gargenville,78,,,78267000AP0559,,,,,,,,,,,,,0,1,Maison,163,7,S,sols,,,675,1.815433,48.992486
2021-1336753,2021-07-27,000001,Vente,476450,55,,RUE DE L ILE DE FRANCE,0880,78440,78267,Gargenville,78,,,78267000AP0559,,,,,,,,,,,,,0,3,Dépendance,,0,S,sols,,,675,1.815433,48.992486
2021-1336860,2021-08-18,000001,Vente,310000,43,,RUE PASTEUR,1260,78440,78267,Gargenville,78,,,78267000AL0053,,,,,,,,,,,,,0,3,Dépendance,,0,S,sols,,,500,1.80793,48.986061
2021-1336860,2021-08-18,000001,Vente,310000,43,,RUE PASTEUR,1260,78440,78267,Gargenville,78,,,78267000AL0053,,,,,,,,,,,,,0,2,Appartement,62,4,S,sols,,,500,1.80793,48.986061
2021-1336860,2021-08-18,000001,Vente,310000,43,,RUE PASTEUR,1260,78440,78267,Gargenville,78,,,78267000AL0053,,,,,,,,,,,,,0,2,Appartement,40,3,S,sols,,,500,1.80793,48.986061
2021-1336860,2021-08-18,000001,Vente,310000,43,,RUE PASTEUR,1260,78440,78267,Gargenville,78,,,78267000AL0053,,,,,,,,,,,,,0,3,Dépendance,,0,AG,terrains d'agrément,JARD,Jardin d'agrément,609,1.80793,48.986061
2021-1336860,2021-08-18,000001,Vente,310000,43,,RUE PASTEUR,1260,78440,78267,Gargenville,78,,,78267000AL0053,,,,,,,,,,,,,0,3,Dépendance,,0,AG,terrains d'agrément,JARD,Jardin d'agrément,609,1.80793,48.986061
2021-1336860,2021-08-18,000001,Vente,310000,43,,RUE PASTEUR,1260,78440,78267,Gargenville,78,,,78267000AL0053,,,,,,,,,,,,,0,2,Appartement,40,3,AG,terrains d'agrément,JARD,Jardin d'agrément,609,1.80793,48.986061
2021-1336860,2021-08-18,000001,Vente,310000,43,,RUE PASTEUR,1260,78440,78267,Gargenville,78,,,78267000AL0053,,,,,,,,,,,,,0,3,Dépendance,,0,S,sols,,,500,1.80793,48.986061
2021-1336860,2021-08-18,000001,Vente,310000,43,,RUE PASTEUR,1260,78440,78267,Gargenville,78,,,78267000AL0053,,,,,,,,,,,,,0,2,Appartement,22,1,S,sols,,,500,1.80793,48.986061
2021-1336860,2021-08-18,000001,Vente,310000,43,,RUE PASTEUR,1260,78440,78267,Gargenville,78,,,78267000AL0053,,,,,,,,,,,,,0,2,Appartement,22,1,AG,terrains d'agrément,JARD,Jardin d'agrément,609,1.80793,48.986061
2021-1336860,2021-08-18,000001,Vente,310000,43,,RUE PASTEUR,1260,78440,78267,Gargenville,78,,,78267000AL0053,,,,,,,,,,,,,0,2,Appartement,62,4,AG,terrains d'agrément,JARD,Jardin d'agrément,609,1.80793,48.986061
2021-1337073,2021-08-03,000001,Vente,315000,9,,RUE JEAN DE LA FONTAINE,0920,78440,78267,Gargenville,78,,,78267000AM0291,,,,,,,,,,,,,0,1,Maison,115,5,S,sols,,,579,1.815653,48.98923
2021-1337130,2021-08-06,000001,Vente,236680,21,,RUE JULES FERRY,1000,78440,78267,Gargenville,78,,,78267000AR0178,,,,,,,,,,,,,0,1,Maison,59,3,S,sols,,,516,1.80844,48.992203
2021-1337542,2021-08-23,000001,Vente,165000,1,,RUE PIERRE ET MARIE CURIE,1320,78440,78267,Gargenville,78,,,78267000ZD0554,,,,,,,,,,,,,0,3,Dépendance,,0,S,sols,,,73,1.808724,48.988337
2021-1337542,2021-08-23,000001,Vente,165000,1,,RUE PIERRE ET MARIE CURIE,1320,78440,78267,Gargenville,78,,,78267000ZD0554,,,,,,,,,,,,,0,1,Maison,63,3,S,sols,,,73,1.808724,48.988337
2021-1337737,2021-08-09,000001,Vente,220000,14,,RUE DU BOCAGE,0070,78440,78267,Gargenville,78,,,78267000AK0012,,,31,86.08,,,,,,,,,1,1,Maison,85,5,S,sols,,,333,1.811721,48.987064
2021-1337739,2021-08-10,000001,Vente,130000,41,,AV JEAN JAURES,0940,78440,78267,Gargenville,78,,,78267000AS0103,,,,,,,,,,,,,0,1,Maison,48,2,AG,terrains d'agrément,JARD,Jardin d'agrément,294,1.80298,48.973902
2021-1337739,2021-08-10,000001,Vente,130000,41,,AV JEAN JAURES,0940,78440,78267,Gargenville,78,,,78267000AS0103,,,,,,,,,,,,,0,1,Maison,48,2,S,sols,,,500,1.80298,48.973902
2021-1337831,2021-08-13,000001,Vente,239900,18,,RUE MARCELLE CHAUSSON,1160,78440,78267,Gargenville,78,,,78267000AH0049,,,,,,,,,,,,,0,1,Maison,64,4,S,sols,,,572,1.812569,48.98152
2021-1337831,2021-08-13,000001,Vente,239900,18,,RUE MARCELLE CHAUSSON,1160,78440,78267,Gargenville,78,,,78267000AH0049,,,,,,,,,,,,,0,3,Dépendance,,0,S,sols,,,572,1.812569,48.98152
2021-1337831,2021-08-13,000001,Vente,239900,18,,RUE MARCELLE CHAUSSON,1160,78440,78267,Gargenville,78,,,78267000AH0049,,,,,,,,,,,,,0,3,Dépendance,,0,S,sols,,,572,1.812569,48.98152
2021-1338010,2021-08-11,000001,Vente,339750,,,AV JEAN JAURES,0940,78440,78267,Gargenville,78,,,78267000AS0086,,,,,,,,,,,,,0,,,,,S,sols,,,369,1.804806,48.974512
2021-1338010,2021-08-11,000001,Vente,339750,21,,AV JEAN JAURES,0940,78440,78267,Gargenville,78,,,78267000AS0087,,,,,,,,,,,,,0,1,Maison,108,4,AG,terrains d'agrément,JARD,Jardin d'agrément,237,1.805042,48.974123
2021-1338010,2021-08-11,000001,Vente,339750,21,,AV JEAN JAURES,0940,78440,78267,Gargenville,78,,,78267000AS0087,,,,,,,,,,,,,0,1,Maison,108,4,S,sols,,,500,1.805042,48.974123
2021-1338204,2021-08-25,000001,Vente,307500,49,,RUE PASTEUR,1260,78440,78267,Gargenville,78,,,78267000AL0043,,,,,,,,,,,,,0,1,Maison,81,4,S,sols,,,686,1.808377,48.986643
2021-1338204,2021-08-25,000001,Vente,307500,49,,RUE PASTEUR,1260,78440,78267,Gargenville,78,,,78267000AL0043,,,,,,,,,,,,,0,3,Dépendance,,0,S,sols,,,686,1.808377,48.986643
2021-1338216,2021-08-16,000001,Vente,325000,66,,RUE PASTEUR,1260,78440,78267,Gargenville,78,,,78267000AK0321,,,,,,,,,,,,,0,1,Maison,118,6,S,sols,,,572,1.809322,48.987624
2021-1338217,2021-08-25,000001,Vente,180000,22,B,RUE DES PRES L ABBE,1360,78440,78267,Gargenville,78,,,78267000AM0496,,,,,,,,,,,,,0,1,Maison,143,6,S,sols,,,292,1.817111,48.990981