id_mutation,date_mutation,numero_disposition,nature_mutation,valeur_fonciere,adresse_numero,adresse_suffixe,adresse_nom_voie,adresse_code_voie,code_postal,code_commune,nom_commune,code_departement,ancien_code_commune,ancien_nom_commune,id_parcelle,ancien_id_parcelle,numero_volume,lot1_numero,lot1_surface_carrez,lot2_numero,lot2_surface_carrez,lot3_numero,lot3_surface_carrez,lot4_numero,lot4_surface_carrez,lot5_numero,lot5_surface_carrez,nombre_lots,code_type_local,type_local,surface_reelle_bati,nombre_pieces_principales,code_nature_culture,nature_culture,code_nature_culture_speciale,nature_culture_speciale,surface_terrain,longitude,latitude
2021-1327838,2021-05-25,000001,Vente,359000,14,,RUE DES FONTAINES,0120,78930,78677,Villette,78,,,78677000ZD0334,,,,,,,,,,,,,0,1,Maison,80,2,S,sols,,,500,1.699649,48.918123
2021-1327838,2021-05-25,000001,Vente,359000,14,,RUE DES FONTAINES,0120,78930,78677,Villette,78,,,78677000ZD0334,,,,,,,,,,,,,0,1,Maison,80,2,AG,terrains d'agrément,JARD,Jardin d'agrément,1373,1.699649,48.918123
2021-1330033,2021-05-31,000001,Vente,256500,7,,RUE DU PAVILLON,0320,78930,78677,Villette,78,,,78677000AB0225,,,,,,,,,,,,,0,1,Maison,72,5,S,sols,,,258,1.690813,48.927841
2021-1330508,2021-06-09,000001,Vente,227000,,,LA FONTAINE A MATHIEU,B025,78930,78677,Villette,78,,,78677000ZD0095,,,,,,,,,,,,,0,,,,,P,prés,,,332,1.69154,48.92033
2021-1330508,2021-06-09,000001,Vente,227000,1,,RUE DES FONTAINES,0120,78930,78677,Villette,78,,,78677000ZD0347,,,,,,,,,,,,,0,1,Maison,121,6,S,sols,,,180,1.691876,48.920615
2021-1332360,2021-06-17,000001,Vente,440000,,,LES LIMOGES,B042,78930,78677,Villette,78,,,78677000ZC0311,,,,,,,,,,,,,0,,,,,T,terres,,,3297,1.707311,48.919356
2021-1332360,2021-06-17,000001,Vente,440000,,,LES LIMOGES,B042,78930,78677,Villette,78,,,78677000ZC0315,,,,,,,,,,,,,0,,,,,T,terres,,,2496,1.70714,48.91975
2021-1332360,2021-06-17,000001,Vente,440000,,,LES LIMOGES,B042,78930,78677,Villette,78,,,78677000ZC0316,,,,,,,,,,,,,0,,,,,T,terres,,,1155,1.706961,48.919798
2021-1332360,2021-06-17,000001,Vente,440000,,,LES LIMOGES,B042,78930,78677,Villette,78,,,78677000ZC0341,,,,,,,,,,,,,0,,,,,BT,taillis simples,,,111,1.707163,48.920742
2021-1332360,2021-06-17,000001,Vente,440000,,,LES LIMOGES,B042,78930,78677,Villette,78,,,78677000ZC0353,,,,,,,,,,,,,0,,,,,BT,taillis simples,,,469,1.707759,48.920343
2021-1332360,2021-06-17,000001,Vente,440000,,,LES LIMOGES,B042,78930,78677,Villette,78,,,78677000ZC0355,,,,,,,,,,,,,0,,,,,BT,taillis simples,,,138,1.707683,48.920123
2021-1332360,2021-06-17,000001,Vente,440000,,,LES LIMOGES,B042,78930,78677,Villette,78,,,78677000ZC0357,,,,,,,,,,,,,0,,,,,BT,taillis simples,,,1371,1.707935,48.920264
2021-1332360,2021-06-17,000001,Vente,440000,20,,RUE DE PARIS,0280,78930,78677,Villette,78,,,78677000ZC0510,,,,,,,,,,,,,0,,,,,S,sols,,,36,1.707841,48.918678
2021-1332360,2021-06-17,000001,Vente,440000,18,,RUE DE PARIS,0280,78930,78677,Villette,78,,,78677000ZC0511,,,,,,,,,,,,,0,1,Maison,168,6,T,terres,,,8574,1.707908,48.91923
2021-1332360,2021-06-17,000001,Vente,440000,18,,RUE DE PARIS,0280,78930,78677,Villette,78,,,78677000ZC0511,,,,,,,,,,,,,0,1,Maison,168,6,S,sols,,,500,1.707908,48.91923
2021-1332657,2021-06-14,000003,Vente,149000,10,,RUE DE PETELANCE,0340,78930,78677,Villette,78,,,78677000ZD0545,,,,,,,,,,,,,0,3,Dépendance,,0,,,,,,1.699183,48.916098
2021-1332657,2021-06-14,000003,Vente,149000,10,,RUE DE PETELANCE,0340,78930,78677,Villette,78,,,78677000ZD0545,,,,,,,,,,,,,0,1,Maison,65,4,,,,,,1.699183,48.916098
2021-1340339,2021-09-17,000001,Vente,352050,7,,RUE DE L EGLISE,0060,78930,78677,Villette,78,,,78677000AB0122,,,,,,,,,,,,,0,1,Maison,157,5,S,sols,,,335,1.690386,48.928744
2021-1340339,2021-09-17,000001,Vente,352050,7,,RUE DE L EGLISE,0060,78930,78677,Villette,78,,,78677000AB0122,,,,,,,,,,,,,0,3,Dépendance,,0,S,sols,,,335,1.690386,48.928744
2021-1345881,2021-10-28,000002,Vente,779790,,,SUR LA RAVINE,B057,78930,78677,Villette,78,,,78677000ZB0228,,,,,,,,,,,,,0,,,,,T,terres,,,27098,1.705698,48.930296
2021-1345881,2021-10-28,000002,Vente,779790,,,LES HAUTES RANGEES,B038,78930,78677,Villette,78,,,78677000ZB0231,,,,,,,,,,,,,0,,,,,BT,taillis simples,,,1159,1.704134,48.928806
2021-1345881,2021-10-28,000002,Vente,779790,,,LES HAUTES RANGEES,B038,78930,78677,Villette,78,,,78677000ZB0232,,,,,,,,,,,,,0,,,,,T,terres,,,2707,1.704695,48.928876
2021-1345881,2021-10-28,000002,Vente,779790,,,LES HAUTES RANGEES,B038,78930,78677,Villette,78,,,78677000ZB0233,,,,,,,,,,,,,0,,,,,BT,taillis simples,,,4653,1.704607,48.929689
2021-1345881,2021-10-28,000002,Vente,779790,,,HEURTELOUP,B039,78930,78677,Villette,78,,,78677000ZB0274,,,,,,,,,,,,,0,,,,,T,terres,,,78467,1.708026,48.929283
2021-1345881,2021-10-28,000002,Vente,779790,,,LE BOIS D HEURTELOUP,B008,78930,78677,Villette,78,,,78677000ZC0508,,,,,,,,,,,,,0,,,,,T,terres,,,213546,1.706561,48.925222
2021-1350438,2021-01-04,000001,Vente,1,,,LE VILLAGE,B066,78930,78677,Villette,78,,,78677000AB0129,,,,,,,,,,,,,0,,,,,BT,taillis simples,,,113,1.692577,48.927711
2021-1350694,2021-02-11,000001,Vente,4700,,,CHEMIN DE GUERVILLE,B015,78930,78677,Villette,78,,,78677000AB0186,,,,,,,,,,,,,0,,,,,P,prés,,,10279,1.694624,48.924785
2021-1350694,2021-02-11,000001,Vente,4700,,,CHE DE GUERVILLE,0160,78930,78677,Villette,78,,,78677000AB0242,,,,,,,,,,,,,0,,,,,P,prés,,,358,1.69358,48.925373
2021-1350853,2021-02-15,000001,Vente,262000,,,LE BOIS DE LEUZE,B009,78930,78677,Villette,78,,,78677000ZD0026,,,,,,,,,,,,,0,,,,,T,terres,,,1430,1.69815,48.916637
2021-1350853,2021-02-15,000001,Vente,262000,17,,RUE DE PETELANCE,0340,78930,78677,Villette,78,,,78677000ZD0164,,,,,,,,,,,,,0,1,Maison,60,3,J,jardins,POTAG,Jardin potager,2421,1.698092,48.916479
2021-1350853,2021-02-15,000001,Vente,262000,17,,RUE DE PETELANCE,0340,78930,78677,Villette,78,,,78677000ZD0164,,,,,,,,,,,,,0,1,Maison,60,3,S,sols,,,500,1.698092,48.916479
2021-1350853,2021-02-15,000001,Vente,262000,17,,RUE DE PETELANCE,0340,78930,78677,Villette,78,,,78677000ZD0165,,,,,,,,,,,,,0,1,Maison,95,6,S,sols,,,111,1.69841,48.916412
2021-1350911,2021-03-10,000001,Vente,249000,,,RTE DE HOUDAN,0180,78930,78677,Villette,78,,,78677000ZD0097,,,,,,,,,,,,,0,,,,,J,jardins,POTAG,Jardin potager,109,1.691394,48.920708
2021-1350911,2021-03-10,000001,Vente,249000,,,LA FONTAINE A MATHIEU,B025,78930,78677,Villette,78,,,78677000ZD0316,,,,,,,,,,,,,0,,,,,L,landes,,,30,1.690838,48.921082
2021-1350911,2021-03-10,000001,Vente,249000,21,,RTE DE HOUDAN,0180,78930,78677,Villette,78,,,78677000ZD0491,,,,,,,,,,,,,0,1,Maison,109,6,AG,terrains d'agrément,JARD,Jardin d'agrément,1196,1.69105,48.920879
2021-1350911,2021-03-10,000001,Vente,249000,21,,RTE DE HOUDAN,0180,78930,78677,Villette,78,,,78677000ZD0491,,,,,,,,,,,,,0,1,Maison,109,6,S,sols,,,500,1.69105,48.920879
