id_mutation,date_mutation,numero_disposition,nature_mutation,valeur_fonciere,adresse_numero,adresse_suffixe,adresse_nom_voie,adresse_code_voie,code_postal,code_commune,nom_commune,code_departement,ancien_code_commune,ancien_nom_commune,id_parcelle,ancien_id_parcelle,numero_volume,lot1_numero,lot1_surface_carrez,lot2_numero,lot2_surface_carrez,lot3_numero,lot3_surface_carrez,lot4_numero,lot4_surface_carrez,lot5_numero,lot5_surface_carrez,nombre_lots,code_type_local,type_local,surface_reelle_bati,nombre_pieces_principales,code_nature_culture,nature_culture,code_nature_culture_speciale,nature_culture_speciale,surface_terrain,longitude,latitude
2021-1352504,2021-01-04,000001,Echange,10000,,,PIERRE BISE,B208,79160,79012,Ardin,79,,,79012000ZK0005,,,,,,,,,,,,,0,,,,,T,terres,,,32300,-0.548529,46.451906
2021-1352504,2021-01-04,000002,Echange,10000,,,LE NOYER ROND,B187,79160,79012,Ardin,79,,,790120000E0027,,,,,,,,,,,,,0,,,,,T,terres,,,5760,-0.572479,46.452598
2021-1352504,2021-01-04,000002,Echange,10000,,,LE NOYER ROND,B187,79160,79012,Ardin,79,,,790120000E0028,,,,,,,,,,,,,0,,,,,T,terres,,,8210,,
2021-1352504,2021-01-04,000002,Echange,10000,,,PRE DES HIBOUX,B234,79160,79012,Ardin,79,,,790120000E0264,,,,,,,,,,,,,0,,,,,T,terres,,,15080,-0.567266,46.455017
2021-1353187,2021-02-02,000001,Vente,80000,,,LE BOURG,B033,79160,79012,Ardin,79,,,79012000AB0011,,,,,,,,,,,,,0,,,,,S,sols,,,32,-0.5568,46.476067
2021-1353187,2021-02-02,000001,Vente,80000,4,,RUE DU CHEVALIER GASPARD,0050,79160,79012,Ardin,79,,,79012000AB0012,,,,,,,,,,,,,0,1,Maison,92,4,J,jardins,,,540,-0.556666,46.476303
2021-1353187,2021-02-02,000001,Vente,80000,4,,RUE DU CHEVALIER GASPARD,0050,79160,79012,Ardin,79,,,79012000AB0012,,,,,,,,,,,,,0,3,Dépendance,,0,S,sols,,,1000,-0.556666,46.476303
2021-1353187,2021-02-02,000001,Vente,80000,4,,RUE DU CHEVALIER GASPARD,0050,79160,79012,Ardin,79,,,79012000AB0012,,,,,,,,,,,,,0,1,Maison,92,4,S,sols,,,1000,-0.556666,46.476303
2021-1353187,2021-02-02,000001,Vente,80000,4,,RUE DU CHEVALIER GASPARD,0050,79160,79012,Ardin,79,,,79012000AB0012,,,,,,,,,,,,,0,3,Dépendance,,0,J,jardins,,,540,-0.556666,46.476303
2021-1353224,2021-01-27,000001,Vente,65000,11,B,RUE DU CHATONNET,0039,79160,79012,Ardin,79,,,79012000ZB0122,,,,,,,,,,,,,0,1,Maison,80,4,S,sols,,,1000,-0.564479,46.479993
2021-1353798,2021-02-09,000002,Vente,478.45,,,PRAIRIE DE POUZAY,B220,79160,79012,Ardin,79,,,790120000C0504,,,,,,,,,,,,,0,,,,,BT,taillis simples,,,230,-0.543458,46.478352
2021-1353798,2021-02-09,000002,Vente,478.45,,,PRAIRIE DE POUZAY,B220,79160,79012,Ardin,79,,,790120000C0505,,,,,,,,,,,,,0,,,,,BT,taillis simples,,,270,-0.54306,46.478169
2021-1354026,2021-02-22,000001,Vente,90000,31,,RUE JEAN DE SAINT GOARS,0080,79160,79012,Ardin,79,,,79012000AB0291,,,,,,,,,,,,,0,1,Maison,115,4,S,sols,,,84,-0.556288,46.475515
2021-1354026,2021-02-22,000001,Vente,90000,,,LE BOURG,B033,79160,79012,Ardin,79,,,79012000AB0293,,,,,,,,,,,,,0,,,,,S,sols,,,15,-0.556272,46.475487
2021-1354026,2021-02-22,000001,Vente,90000,27,,RUE JEAN DE SAINT GOARS,0080,79160,79012,Ardin,79,,,79012000AB0298,,,,,,,,,,,,,0,,,,,S,sols,,,96,-0.556339,46.475551
2021-1354069,2021-02-18,000001,Vente,1000,,,PRAIRIE DE LA NOUE GIRARD,B218,79160,79012,Ardin,79,,,790120000A0441,,,,,,,,,,,,,0,,,,,P,prés,,,4550,-0.559279,46.502439
2021-1354139,2021-02-25,000001,Vente,28000,,,PRAIRIE DU SOUCIER,B226,79160,79012,Ardin,79,,,790120000C0964,,,,,,,,,,,,,0,,,,,P,prés,,,2400,-0.529141,46.500315
2021-1354139,2021-02-25,000001,Vente,28000,,,LA MONTAGNE,B178,79160,79012,Ardin,79,,,790120000C1012,,,,,,,,,,,,,0,,,,,P,prés,,,2410,-0.529362,46.499636
2021-1354139,2021-02-25,000001,Vente,28000,,,LA MONTAGNE,B178,79160,79012,Ardin,79,,,790120000C1013,,,,,,,,,,,,,0,,,,,BT,taillis simples,,,1170,-0.529185,46.499515
2021-1354139,2021-02-25,000001,Vente,28000,,,LA MONTAGNE,B178,79160,79012,Ardin,79,,,790120000C1014,,,,,,,,,,,,,0,,,,,P,prés,,,3310,-0.529077,46.499277
2021-1354139,2021-02-25,000001,Vente,28000,,,LA MONTAGNE,B178,79160,79012,Ardin,79,,,790120000C1020,,,,,,,,,,,,,0,,,,,T,terres,,,7100,-0.530013,46.499149
2021-1354139,2021-02-25,000001,Vente,28000,,,LA MONTAGNE,B178,79160,79012,Ardin,79,,,790120000C1021,,,,,,,,,,,,,0,,,,,T,terres,,,1700,-0.53062,46.499317
2021-1354139,2021-02-25,000001,Vente,28000,,,LA MONTAGNE,B178,79160,79012,Ardin,79,,,790120000C1022,,,,,,,,,,,,,0,,,,,T,terres,,,1690,-0.530647,46.498711
2021-1354139,2021-02-25,000001,Vente,28000,,,LA MONTAGNE,B178,79160,79012,Ardin,79,,,790120000C1023,,,,,,,,,,,,,0,,,,,T,terres,,,590,-0.53077,46.498466
2021-1354139,2021-02-25,000001,Vente,28000,,,LA MONTAGNE,B178,79160,79012,Ardin,79,,,790120000C1153,,,,,,,,,,,,,0,,,,,S,sols,,,1865,-0.529997,46.49853
2021-1354139,2021-02-25,000001,Vente,28000,,,PRAIRIE DU SOUCIER,B226,79160,79012,Ardin,79,,,790120000C1239,,,,,,,,,,,,,0,,,,,P,prés,,,2878,-0.528726,46.500051
2021-1354139,2021-02-25,000001,Vente,28000,,,FONTBRIAND,B123,79160,79012,Ardin,79,,,790120000C1242,,,,,,,,,,,,,0,,,,,P,prés,,,5148,-0.529466,46.501008
2021-1354139,2021-02-25,000001,Vente,28000,,,LA MONTAGNE,B178,79160,79012,Ardin,79,,,790120000C1245,,,,,,,,,,,,,0,,,,,P,prés,,,2221,-0.528644,46.499299
2021-1354678,2021-03-19,000001,Vente,210000,,,LA VIGNE A GUITTON,B289,79160,79012,Ardin,79,,,79012000ZS0011,,,,,,,,,,,,,0,,,,,T,terres,,,3640,-0.549075,46.518029
2021-1354678,2021-03-19,000001,Vente,210000,,,LA VIGNE A GUITTON,B289,79160,79012,Ardin,79,,,79012000ZS0011,,,,,,,,,,,,,0,,,,,S,sols,,,1260,-0.549075,46.518029
2021-1354678,2021-03-19,000001,Vente,210000,1,B,LA CROIX MARAUD,B300,79160,79012,Ardin,79,,,79012000ZS0069,,,,,,,,,,,,,0,,,,,S,sols,,,1120,-0.549733,46.516977
2021-1354678,2021-03-19,000001,Vente,210000,1,B,LA CROIX MARAUD,B300,79160,79012,Ardin,79,,,79012000ZS0069,,,,,,,,,,,,,0,,,,,T,terres,,,2790,-0.549733,46.516977
2021-1354678,2021-03-19,000001,Vente,210000,1,B,LA CROIX MARAUD,B300,79160,79012,Ardin,79,,,79012000ZS0081,,,,,,,,,,,,,0,,,,,S,sols,,,1360,-0.54982,46.517368
2021-1354678,2021-03-19,000001,Vente,210000,,,LA VIGNE A GUITTON,B289,79160,79012,Ardin,79,,,79012000ZS0083,,,,,,,,,,,,,0,,,,,T,terres,,,3496,-0.549693,46.517478
2021-1354678,2021-03-19,000001,Vente,210000,,,LA VIGNE A GUITTON,B289,79160,79012,Ardin,79,,,79012000ZS0083,,,,,,,,,,,,,0,,,,,T,terres,,,2963,-0.549693,46.517478
2021-1354678,2021-03-19,000001,Vente,210000,,,LA VIGNE A GUITTON,B289,79160,79012,Ardin,79,,,79012000ZS0083,,,,,,,,,,,,,0,,,,,S,sols,,,9889,-0.549693,46.517478
2021-1354678,2021-03-19,000001,Vente,210000,,,LA CROIX MARAUD,B300,79160,79012,Ardin,79,,,79012000ZS0085,,,,,,,,,,,,,0,,,,,S,sols,,,150,-0.549943,46.517039
2021-1355288,2021-03-26,000001,Vente,208000,9,,RUE DE LA VIGNE DU PUITS,0185,79160,79012,Ardin,79,,,790120000F0883,,,,,,,,,,,,,0,1,Maison,105,4,S,sols,,,1000,-0.563149,46.472322
2021-1355288,2021-03-26,000001,Vente,208000,9,,RUE DE LA VIGNE DU PUITS,0185,79160,79012,Ardin,79,,,790120000F0883,,,,,,,,,,,,,0,1,Maison,105,4,AG,terrains d'agrément,,,5873,-0.563149,46.472322
2021-1355356,2021-04-19,000001,Vente,225360,3,,RTE DES 5 CHEMINS,0053,79160,79012,Ardin,79,,,790120000F0116,,,,,,,,,,,,,0,1,Maison,175,6,S,sols,,,1070,-0.567415,46.472303
2021-1355575,2021-04-06,000001,Vente,65000,,,GRIGNON,B156,79160,79012,Ardin,79,,,790120000F0591,,,,,,,,,,,,,0,,,,,S,sols,,,106,-0.562815,46.475778
2021-1355575,2021-04-06,000001,Vente,65000,13,,RTE DE COULONGES,0063,79160,79012,Ardin,79,,,790120000F1198,,,,,,,,,,,,,0,,,,,S,sols,,,47,-0.562923,46.475708
2021-1355575,2021-04-06,000001,Vente,65000,13,,RTE DE COULONGES,0063,79160,79012,Ardin,79,,,790120000F1247,,,,,,,,,,,,,0,1,Maison,75,3,S,sols,,,420,-0.56289,46.475614
2021-1355727,2021-04-12,000001,Vente,2600,,,LE VIVIER OUEST,B299,79160,79012,Ardin,79,,,790120000F0012,,,,,,,,,,,,,0,,,,,S,sols,,,220,-0.571864,46.46745
2021-1355727,2021-04-12,000001,Vente,2600,,,LE VIVIER OUEST,B299,79160,79012,Ardin,79,,,790120000F0015,,,,,,,,,,,,,0,,,,,T,terres,,,1890,-0.571084,46.467866
2021-1355727,2021-04-12,000001,Vente,2600,,,LE VIVIER OUEST,B299,79160,79012,Ardin,79,,,790120000F0016,,,,,,,,,,,,,0,,,,,T,terres,,,1450,-0.570624,46.467993
2021-1355855,2021-04-14,000001,Vente,23000,,,LES CHAMPS DU PUITS,B080,79160,79012,Ardin,79,,,790120000F0609,,,,,,,,,,,,,0,,,,,T,terres,,,5120,-0.56433,46.474703
2021-1355855,2021-04-14,000001,Vente,23000,,,LES CHAMPS DU PUITS,B080,79160,79012,Ardin,79,,,790120000F0610,,,,,,,,,,,,,0,,,,,T,terres,,,12220,-0.56507,46.474247
2021-1355855,2021-04-14,000001,Vente,23000,,,LES CHAMPS DU PUITS,B080,79160,79012,Ardin,79,,,790120000F0947,,,,,,,,,,,,,0,,,,,T,terres,,,7050,-0.563926,46.473561
2021-1355926,2021-04-22,000001,Vente,172000,38,,RTE DE COULONGES,0063,79160,79012,Ardin,79,,,790120000F0207,,,,,,,,,,,,,0,3,Dépendance,,0,S,sols,,,950,-0.5638,46.477571
2021-1355926,2021-04-22,000001,Vente,172000,38,,RTE DE COULONGES,0063,79160,79012,Ardin,79,,,790120000F0207,,,,,,,,,,,,,0,1,Maison,125,6,S,sols,,,950,-0.5638,46.477571
2021-1355926,2021-04-22,000001,Vente,172000,,,GRIGNON,B156,79160,79012,Ardin,79,,,790120000F0209,,,,,,,,,,,,,0,,,,,J,jardins,,,530,-0.56401,46.477794
2021-1355929,2021-04-16,000001,Vente,71000,67,,RUE DE LA FONTAINE JUBERT,0076,79160,79012,Ardin,79,,,790120000F1033,,,,,,,,,,,,,0,1,Maison,58,3,S,sols,,,1000,-0.559672,46.469377
2021-1356490,2021-05-07,000001,Vente,126500,2,,RUE DE VRIGNE AUX BOIS,0190,79160,79012,Ardin,79,,,790120000F1039,,,,,,,,,,,,,0,1,Maison,77,3,S,sols,,,1053,-0.55186,46.476471
2021-1356926,2021-05-27,000001,Vente,205000,,,LE BOURG,B033,79160,79012,Ardin,79,,,79012000AB0244,,,,,,,,,,,,,0,,,,,J,jardins,,,702,-0.558155,46.47314
2021-1356926,2021-05-27,000001,Vente,205000,14,,PL LOUIS DUTAUD,0100,79160,79012,Ardin,79,,,79012000AB0247,,,,,,,,,,,,,0,,,,,S,sols,,,4,-0.557961,46.473301
2021-1356926,2021-05-27,000001,Vente,205000,14,,PL LOUIS DUTAUD,0100,79160,79012,Ardin,79,,,79012000AB0248,,,,,,,,,,,,,0,1,Maison,192,5,S,sols,,,446,-0.558286,46.473197
2021-1356926,2021-05-27,000001,Vente,205000,,,LE BOURG,B033,79160,79012,Ardin,79,,,79012000AB0259,,,,,,,,,,,,,0,,,,,S,sols,,,11,-0.558467,46.473143
2021-1356926,2021-05-27,000001,Vente,205000,,,LE PRIEURE,B250,79160,79012,Ardin,79,,,790120000F0371,,,,,,,,,,,,,0,,,,,P,prés,,,4000,-0.557112,46.473094
2021-1356926,2021-05-27,000001,Vente,205000,,,LE PRIEURE,B250,79160,79012,Ardin,79,,,790120000F0373,,,,,,,,,,,,,0,,,,,J,jardins,,,270,-0.557545,46.473035
2021-1356926,2021-05-27,000001,Vente,205000,,,LE PRIEURE,B250,79160,79012,Ardin,79,,,790120000F0375,,,,,,,,,,,,,0,,,,,P,prés,,,1260,-0.558007,46.472995
2021-1356926,2021-05-27,000001,Vente,205000,,,LE PRIEURE,B250,79160,79012,Ardin,79,,,790120000F0376,,,,,,,,,,,,,0,,,,,P,prés,,,3395,-0.557869,46.47269
2021-1356941,2021-05-19,000001,Vente,107000,21,,RUE DU CAPITAINE DE JOUSLARD,0030,79160,79012,Ardin,79,,,79012000AB0183,,,,,,,,,,,,,0,1,Maison,62,3,S,sols,,,183,-0.558772,46.473835
2021-1357743,2021-06-04,000001,Vente,23000,,,LE BOURG,B033,79160,79012,Ardin,79,,,79012000AB0015,,,,,,,,,,,,,0,,,,,J,jardins,,,710,-0.556184,46.476156
2021-1357743,2021-06-04,000001,Vente,23000,8,,RUE DU CAPITAINE DE JOUSLARD,0030,79160,79012,Ardin,79,,,79012000AB0133,,,,,,,,,,,,,0,1,Maison,75,3,S,sols,,,100,-0.557884,46.473865
2021-1357745,2021-06-04,000001,Vente,1,,,LA COMBE,B096,79160,79012,Ardin,79,,,790120000F0092,,,,,,,,,,,,,0,,,,,J,jardins,,,600,-0.570897,46.469216
2021-1357779,2021-06-25,000001,Vente,19400,,,LES GRANDES FOUGERES EST,B151,79160,79012,Ardin,79,,,790120000G0226,,,,,,,,,,,,,0,,,,,T,terres,,,12180,-0.566185,46.499465
2021-1357779,2021-06-25,000001,Vente,19400,,,LES GRANDES FOUGERES EST,B151,79160,79012,Ardin,79,,,790120000G0227,,,,,,,,,,,,,0,,,,,S,sols,,,1750,-0.566503,46.499012
2021-1357779,2021-06-25,000001,Vente,19400,,,LES GRANDES FOUGERES EST,B151,79160,79012,Ardin,79,,,790120000G0228,,,,,,,,,,,,,0,,,,,S,sols,,,2330,-0.566822,46.49882
2021-1357779,2021-06-25,000001,Vente,19400,,,LES GRANDES FOUGERES SUD,B152,79160,79012,Ardin,79,,,79012000ZA0074,,,,,,,,,,,,,0,,,,,T,terres,,,6667,-0.56718,46.499197
2021-1357779,2021-06-25,000001,Vente,19400,,,LES GRANDES FOUGERES SUD,B152,79160,79012,Ardin,79,,,79012000ZA0074,,,,,,,,,,,,,0,,,,,T,terres,,,3333,-0.56718,46.499197
2021-1357810,2021-06-28,000001,Vente,544375,,,CHAMBRON,B048,79160,79012,Ardin,79,,,79012000AC0080,,,,,,,,,,,,,0,,,,,J,jardins,,,680,-0.547093,46.465698
2021-1357810,2021-06-28,000001,Vente,544375,68,,RUE DU LOGIS DE LA FOSSE,0097,79160,79012,Ardin,79,,,79012000AC0215,,,,,,,,,,,,,0,3,Dépendance,,0,S,sols,,,2326,-0.547042,46.465428
2021-1357810,2021-06-28,000001,Vente,544375,68,,RUE DU LOGIS DE LA FOSSE,0097,79160,79012,Ardin,79,,,79012000AC0215,,,,,,,,,,,,,0,3,Dépendance,,0,S,sols,,,2326,-0.547042,46.465428
2021-1357810,2021-06-28,000001,Vente,544375,68,,RUE DU LOGIS DE LA FOSSE,0097,79160,79012,Ardin,79,,,79012000AC0215,,,,,,,,,,,,,0,3,Dépendance,,0,S,sols,,,2326,-0.547042,46.465428
2021-1357810,2021-06-28,000001,Vente,544375,68,,RUE DU LOGIS DE LA FOSSE,0097,79160,79012,Ardin,79,,,79012000AC0215,,,,,,,,,,,,,0,1,Maison,260,5,S,sols,,,2326,-0.547042,46.465428
2021-1357810,2021-06-28,000001,Vente,544375,,,CHAMBRON,B048,79160,79012,Ardin,79,,,79012000AC0216,,,,,,,,,,,,,0,,,,,T,terres,,,2066,-0.547549,46.465312
2021-1357810,2021-06-28,000001,Vente,544375,,,CHAMP DU CLOS,B055,79160,79012,Ardin,79,,,790120000D0608,,,,,,,,,,,,,0,,,,,T,terres,,,6250,-0.546746,46.465078
2021-1357850,2021-06-03,000001,Vente,1500,,,LES OUCHES DE MORTAY,B193,79160,79012,Ardin,79,,,790120000C0429,,,,,,,,,,,,,0,,,,,T,terres,,,2160,-0.540106,46.484637
2021-1357850,2021-06-03,000001,Vente,1500,,,LES OUCHES DE MORTAY,B193,79160,79012,Ardin,79,,,790120000C0431,,,,,,,,,,,,,0,,,,,P,prés,,,2000,-0.539983,46.484131
2021-1357850,2021-06-03,000001,Vente,1500,,,LES OUCHES DE MORTAY,B193,79160,79012,Ardin,79,,,790120000C0433,,,,,,,,,,,,,0,,,,,T,terres,,,740,-0.539667,46.484219
2021-1357850,2021-06-03,000001,Vente,1500,,,LES OUCHES DE MORTAY,B193,79160,79012,Ardin,79,,,790120000C0434,,,,,,,,,,,,,0,,,,,T,terres,,,540,-0.539777,46.484436
2021-1358276,2021-06-18,000001,Vente,20000,,,LE VIVIER OUEST,B299,79160,79012,Ardin,79,,,790120000F0017,,,,,,,,,,,,,0,,,,,T,terres,,,1710,-0.570391,46.467633
2021-1358276,2021-06-18,000001,Vente,20000,18,,RTE DES 5 CHEMINS,0053,79160,79012,Ardin,79,,,790120000F0018,,,,,,,,,,,,,0,,,,,T,terres,,,3017,-0.571078,46.467295
2021-1358276,2021-06-18,000001,Vente,20000,18,,RTE DES 5 CHEMINS,0053,79160,79012,Ardin,79,,,790120000F0018,,,,,,,,,,,,,0,,,,,S,sols,,,713,-0.571078,46.467295
2021-1358276,2021-06-18,000001,Vente,20000,,,LE VIVIER OUEST,B299,79160,79012,Ardin,79,,,790120000F0019,,,,,,,,,,,,,0,,,,,S,sols,,,462,-0.571426,46.467157
2021-1358276,2021-06-18,000001,Vente,20000,,,LE VIVIER OUEST,B299,79160,79012,Ardin,79,,,790120000F0020,,,,,,,,,,,,,0,,,,,S,sols,,,20,-0.571444,46.467366
2021-1358276,2021-06-18,000001,Vente,20000,,,LE VIVIER OUEST,B299,79160,79012,Ardin,79,,,790120000F0020,,,,,,,,,,,,,0,,,,,T,terres,,,964,-0.571444,46.467366
2021-1358276,2021-06-18,000001,Vente,20000,,,LE VIVIER OUEST,B299,79160,79012,Ardin,79,,,790120000F0026,,,,,,,,,,,,,0,,,,,T,terres,,,3872,-0.570605,46.466912
2021-1358276,2021-06-18,000001,Vente,20000,,,LE VIVIER OUEST,B299,79160,79012,Ardin,79,,,790120000F0026,,,,,,,,,,,,,0,,,,,S,sols,,,648,-0.570605,46.466912
2021-1358276,2021-06-18,000001,Vente,20000,,,LE VIVIER OUEST,B299,79160,79012,Ardin,79,,,790120000F0027,,,,,,,,,,,,,0,,,,,T,terres,,,1340,-0.5699,46.467236
2021-1358276,2021-06-18,000001,Vente,20000,,,LE VIVIER OUEST,B299,79160,79012,Ardin,79,,,790120000F0029,,,,,,,,,,,,,0,,,,,J,jardins,,,370,-0.56927,46.467146
2021-1358276,2021-06-18,000001,Vente,20000,,,LE VIVIER OUEST,B299,79160,79012,Ardin,79,,,790120000F0030,,,,,,,,,,,,,0,,,,,T,terres,,,3540,-0.569733,46.466917
2021-1358276,2021-06-18,000001,Vente,20000,6,,RTE DE COULONGES,0063,79160,79012,Ardin,79,,,790120000F0890,,,,,,,,,,,,,0,,,,,S,sols,,,717,-0.571663,46.466978
2021-1358276,2021-06-18,000001,Vente,20000,,,LE VIVIER OUEST,B299,79160,79012,Ardin,79,,,790120000F0932,,,,,,,,,,,,,0,,,,,S,sols,,,448,-0.571896,46.46704
2021-1358276,2021-06-18,000001,Vente,20000,,,LE VIVIER OUEST,B299,79160,79012,Ardin,79,,,790120000F0966,,,,,,,,,,,,,0,,,,,T,terres,,,1182,-0.571579,46.467505
2021-1358278,2021-06-18,000001,Vente,5500,,,LA GACONNIERE,B129,79160,79012,Ardin,79,,,790120000A0739,,,,,,,,,,,,,0,,,,,S,sols,,,1015,-0.550813,46.511166
2021-1358278,2021-06-18,000001,Vente,5500,,,LA GACONNIERE,B129,79160,79012,Ardin,79,,,790120000A0740,,,,,,,,,,,,,0,,,,,S,sols,,,432,-0.551125,46.511295
2021-1358283,2021-06-24,000001,Vente,155000,7,,RTE DE COULONGES,0063,79160,79012,Ardin,79,,,790120000F0597,,,,,,,,,,,,,0,1,Maison,97,4,S,sols,,,680,-0.562529,46.474809
2021-1358283,2021-06-24,000001,Vente,155000,7,,RTE DE COULONGES,0063,79160,79012,Ardin,79,,,790120000F0597,,,,,,,,,,,,,0,3,Dépendance,,0,S,sols,,,680,-0.562529,46.474809
2021-1358283,2021-06-24,000001,Vente,155000,,,GRIGNON,B156,79160,79012,Ardin,79,,,790120000F0598,,,,,,,,,,,,,0,,,,,P,prés,,,1310,-0.562618,46.47463
2021-1358796,2021-06-29,000001,Vente,50000,,,LES OUCHES DE MORTAY,B193,79160,79012,Ardin,79,,,790120000C0417,,,,,,,,,,,,,0,,,,,T,terres,,,5260,-0.541449,46.48512
2021-1358796,2021-06-29,000001,Vente,50000,,,LES OUCHES DE MORTAY,B193,79160,79012,Ardin,79,,,790120000C0418,,,,,,,,,,,,,0,,,,,T,terres,,,930,-0.542028,46.485391
2021-1358796,2021-06-29,000001,Vente,50000,,,LES OUCHES DE MORTAY,B193,79160,79012,Ardin,79,,,790120000C0419,,,,,,,,,,,,,0,,,,,T,terres,,,3420,-0.542115,46.485873
2021-1358796,2021-06-29,000001,Vente,50000,,,LES OUCHES DE MORTAY,B193,79160,79012,Ardin,79,,,790120000C0420,,,,,,,,,,,,,0,,,,,T,terres,,,1640,-0.541603,46.485926
2021-1358796,2021-06-29,000001,Vente,50000,,,LES OUCHES DE MORTAY,B193,79160,79012,Ardin,79,,,790120000C0421,,,,,,,,,,,,,0,,,,,T,terres,,,4890,-0.541316,46.485804
2021-1358796,2021-06-29,000001,Vente,50000,,,LES OUCHES DE MORTAY,B193,79160,79012,Ardin,79,,,790120000C0430,,,,,,,,,,,,,0,,,,,T,terres,,,1400,-0.540713,46.484444
2021-1358796,2021-06-29,000001,Vente,50000,,,PRES DE LONGECOU,B245,79160,79012,Ardin,79,,,790120000C0458,,,,,,,,,,,,,0,,,,,P,prés,,,1920,-0.54085,46.483081
2021-1358796,2021-06-29,000001,Vente,50000,,,PRES DE LONGECOU,B245,79160,79012,Ardin,79,,,790120000C0466,,,,,,,,,,,,,0,,,,,P,prés,,,3320,-0.540952,46.484211
2021-1358796,2021-06-29,000001,Vente,50000,,,PRES DE LONGECOU,B245,79160,79012,Ardin,79,,,790120000C0467,,,,,,,,,,,,,0,,,,,P,prés,,,680,-0.541529,46.484125
2021-1358796,2021-06-29,000001,Vente,50000,,,BESSUIS,B015,79160,79012,Ardin,79,,,790120000C0470,,,,,,,,,,,,,0,,,,,P,prés,,,2290,-0.542306,46.4841
2021-1358796,2021-06-29,000001,Vente,50000,,,BESSUIS,B015,79160,79012,Ardin,79,,,790120000C0477,,,,,,,,,,,,,0,,,,,BT,taillis simples,,,1070,-0.542101,46.48375
2021-1358796,2021-06-29,000001,Vente,50000,,,BESSUIS,B015,79160,79012,Ardin,79,,,790120000C0481,,,,,,,,,,,,,0,,,,,P,prés,,,1130,-0.541642,46.483223
2021-1358796,2021-06-29,000001,Vente,50000,,,BESSUIS,B015,79160,79012,Ardin,79,,,790120000C0482,,,,,,,,,,,,,0,,,,,P,prés,,,1150,-0.541277,46.483068
2021-1358796,2021-06-29,000001,Vente,50000,,,BESSUIS,B015,79160,79012,Ardin,79,,,790120000C0483,,,,,,,,,,,,,0,,,,,P,prés,,,1040,-0.541837,46.483005
2021-1358796,2021-06-29,000001,Vente,50000,,,BESSUIS,B015,79160,79012,Ardin,79,,,790120000C0484,,,,,,,,,,,,,0,,,,,T,terres,,,1460,-0.542142,46.482772
2021-1358796,2021-06-29,000001,Vente,50000,,,CHAMP DU PONT PANNETIER,B056,79160,79012,Ardin,79,,,790120000C0727,,,,,,,,,,,,,0,,,,,T,terres,,,5220,-0.527537,46.491982
2021-1358796,2021-06-29,000001,Vente,50000,,,CHAMP DU PONT PANNETIER,B056,79160,79012,Ardin,79,,,790120000C0741,,,,,,,,,,,,,0,,,,,T,terres,,,8170,-0.528877,46.490386
2021-1358796,2021-06-29,000001,Vente,50000,,,CHAMP DU PONT PANNETIER,B056,79160,79012,Ardin,79,,,790120000C1088,,,,,,,,,,,,,0,,,,,T,terres,,,895,-0.528962,46.491164
2021-1358796,2021-06-29,000001,Vente,50000,,,CHAMP DU PONT PANNETIER,B056,79160,79012,Ardin,79,,,790120000C1089,,,,,,,,,,,,,0,,,,,T,terres,,,895,-0.529124,46.491085
2021-1358796,2021-06-29,000001,Vente,50000,,,CHAMP DU PONT PANNETIER,B056,79160,79012,Ardin,79,,,790120000C1090,,,,,,,,,,,,,0,,,,,T,terres,,,3895,-0.527918,46.491031
2021-1358796,2021-06-29,000001,Vente,50000,,,CHAMP DU PONT PANNETIER,B056,79160,79012,Ardin,79,,,790120000C1091,,,,,,,,,,,,,0,,,,,T,terres,,,3895,-0.528049,46.49042
2021-1358796,2021-06-29,000001,Vente,50000,,,PRE ROBIN,B239,79160,79012,Ardin,79,,,790120000C1115,,,,,,,,,,,,,0,,,,,T,terres,,,6640,-0.529578,46.490337
2021-1358796,2021-06-29,000001,Vente,50000,,,PRE ROBIN,B239,79160,79012,Ardin,79,,,79012000ZX0012,,,,,,,,,,,,,0,,,,,T,terres,,,18570,-0.534661,46.490611
2021-1358796,2021-06-29,000001,Vente,50000,,,PRE ROBIN,B239,79160,79012,Ardin,79,,,79012000ZX0012,,,,,,,,,,,,,0,,,,,VI,vignes,,,1980,-0.534661,46.490611
2021-1358796,2021-06-29,000001,Vente,50000,,,PRE ROBIN,B239,79160,79012,Ardin,79,,,79012000ZX0012,,,,,,,,,,,,,0,,,,,VI,vignes,,,1040,-0.534661,46.490611
2021-1358796,2021-06-29,000001,Vente,50000,,,LA MAILLETTE OUEST,B169,79160,79012,Ardin,79,,,79012000ZX0039,,,,,,,,,,,,,0,,,,,T,terres,,,11770,-0.531136,46.488402
2021-1358796,2021-06-29,000001,Vente,50000,,,LA MAILLETTE OUEST,B169,79160,79012,Ardin,79,,,79012000ZX0041,,,,,,,,,,,,,0,,,,,T,terres,,,14450,-0.53295,46.488443
2021-1358796,2021-06-29,000001,Vente,50000,,,LES CHAILLOTS,B045,79160,79012,Ardin,79,,,79012000ZX0046,,,,,,,,,,,,,0,,,,,T,terres,,,29390,-0.534273,46.485904
2021-1358796,2021-06-29,000001,Vente,50000,,,LES CHAILLOTS,B045,79160,79012,Ardin,79,,,79012000ZX0047,,,,,,,,,,,,,0,,,,,T,terres,,,19920,-0.535294,46.485202
2021-1358796,2021-06-29,000001,Vente,50000,,,LES OUCHES DE MORTAY SUD,B194,79160,79012,Ardin,79,,,79012000ZX0058,,,,,,,,,,,,,0,,,,,T,terres,,,4980,-0.540308,46.485485
2021-1358796,2021-06-29,000001,Vente,50000,,,LES OUCHES DE MORTAY SUD,B194,79160,79012,Ardin,79,,,79012000ZX0058,,,,,,,,,,,,,0,,,,,T,terres,,,2490,-0.540308,46.485485
2021-1358796,2021-06-29,000001,Vente,50000,,,FIEF DE L EPINERAY,B119,79160,79012,Ardin,79,,,79012000ZY0010,,,,,,,,,,,,,0,,,,,T,terres,,,19820,-0.542746,46.483378
2021-1358902,2021-07-02,000001,Vente,105000,2,,RUE DE LA MAILLETTE,0107,79160,79012,Ardin,79,,,790120000C0537,,,,,,,,,,,,,0,1,Maison,100,2,S,sols,,,464,-0.538532,46.483746
2021-1358902,2021-07-02,000001,Vente,105000,2,,RUE DE LA MAILLETTE,0107,79160,79012,Ardin,79,,,790120000C0537,,,,,,,,,,,,,0,3,Dépendance,,0,S,sols,,,464,-0.538532,46.483746
2021-1358902,2021-07-02,000001,Vente,105000,,,MORTAY,B180,79160,79012,Ardin,79,,,790120000C0538,,,,,,,,,,,,,0,,,,,S,sols,,,78,-0.538359,46.483821
2021-1358902,2021-07-02,000001,Vente,105000,,,MORTAY,B180,79160,79012,Ardin,79,,,790120000C1158,,,,,,,,,,,,,0,,,,,P,prés,,,2340,-0.538899,46.483425
2021-1358905,2021-07-05,000001,Vente,1000,,,BEAUCHENE,B011,79160,79012,Ardin,79,,,79012000ZW0057,,,,,,,,,,,,,0,,,,,T,terres,,,4470,-0.542396,46.498679
2021-1358905,2021-07-05,000001,Vente,1000,,,BEAUCHENE,B011,79160,79012,Ardin,79,,,79012000ZW0063,,,,,,,,,,,,,0,,,,,S,sols,,,781,-0.542411,46.499176
2021-1358906,2021-07-06,000001,Vente,28000,,,CHAMBRON,B048,79160,79012,Ardin,79,,,79012000AC0044,,,,,,,,,,,,,0,,,,,P,prés,,,1445,-0.549303,46.468255
2021-1358906,2021-07-06,000001,Vente,28000,,,CHAMBRON,B048,79160,79012,Ardin,79,,,79012000AC0044,,,,,,,,,,,,,0,,,,,S,sols,,,68,-0.549303,46.468255
2021-1358906,2021-07-06,000001,Vente,28000,,,CHAMBRON,B048,79160,79012,Ardin,79,,,79012000AC0045,,,,,,,,,,,,,0,,,,,S,sols,,,81,-0.549237,46.468334
2021-1358906,2021-07-06,000001,Vente,28000,,,CHAMBRON,B048,79160,79012,Ardin,79,,,79012000AC0149,,,,,,,,,,,,,0,,,,,T,terres,,,564,-0.549183,46.468361
2021-1358906,2021-07-06,000001,Vente,28000,,,CHAMBRON,B048,79160,79012,Ardin,79,,,79012000AC0151,,,,,,,,,,,,,0,,,,,T,terres,,,106,-0.548895,46.468172
2021-1358906,2021-07-06,000001,Vente,28000,,,PRE DU SIGNE,B235,79160,79012,Ardin,79,,,790120000D1054,,,,,,,,,,,,,0,,,,,P,prés,,,15050,-0.550079,46.468932