id_mutation,date_mutation,numero_disposition,nature_mutation,valeur_fonciere,adresse_numero,adresse_suffixe,adresse_nom_voie,adresse_code_voie,code_postal,code_commune,nom_commune,code_departement,ancien_code_commune,ancien_nom_commune,id_parcelle,ancien_id_parcelle,numero_volume,lot1_numero,lot1_surface_carrez,lot2_numero,lot2_surface_carrez,lot3_numero,lot3_surface_carrez,lot4_numero,lot4_surface_carrez,lot5_numero,lot5_surface_carrez,nombre_lots,code_type_local,type_local,surface_reelle_bati,nombre_pieces_principales,code_nature_culture,nature_culture,code_nature_culture_speciale,nature_culture_speciale,surface_terrain,longitude,latitude
2021-1353169,2021-02-02,000001,Vente,1200,,,LE BOURG,B013,79170,79198,Paizay-le-Chapt,79,,,791980000F0217,,,,,,,,,,,,,0,,,,,T,terres,,,1441,-0.17595,46.082515
2021-1354261,2021-03-11,000001,Vente,1000,,,LES CHOTARDS,B039,79170,79198,Paizay-le-Chapt,79,,,791980000D0070,,,,,,,,,,,,,0,,,,,BT,taillis simples,,,5756,-0.196553,46.055129
2021-1354261,2021-03-11,000001,Vente,1000,,,LES ROUTES,B132,79170,79198,Paizay-le-Chapt,79,,,79198000ZD0018,,,,,,,,,,,,,0,,,,,T,terres,,,2010,-0.169491,46.085044
2021-1354819,2021-03-17,000001,Vente,12500,3,,RUE DU LAVOIR,0097,79170,79198,Paizay-le-Chapt,79,,,791980000F0187,,,,,,,,,,,,,0,3,Dépendance,,0,S,sols,,,445,-0.179007,46.084105
2021-1354819,2021-03-17,000001,Vente,12500,3,,RUE DU LAVOIR,0097,79170,79198,Paizay-le-Chapt,79,,,791980000F0187,,,,,,,,,,,,,0,1,Maison,56,3,S,sols,,,445,-0.179007,46.084105
2021-1354819,2021-03-17,000001,Vente,12500,3,,RUE DU LAVOIR,0097,79170,79198,Paizay-le-Chapt,79,,,791980000F0187,,,,,,,,,,,,,0,3,Dépendance,,0,S,sols,,,445,-0.179007,46.084105
2021-1354819,2021-03-17,000001,Vente,12500,,,LE BOURG,B013,79170,79198,Paizay-le-Chapt,79,,,791980000F0188,,,,,,,,,,,,,0,,,,,J,jardins,,,524,-0.179101,46.083935
2021-1354819,2021-03-17,000001,Vente,12500,1,,RUE DU LAVOIR,0097,79170,79198,Paizay-le-Chapt,79,,,791980000F0881,,,,,,,,,,,,,0,,,,,S,sols,,,157,-0.178859,46.084276
2021-1354819,2021-03-17,000001,Vente,12500,1,,RUE DU LAVOIR,0097,79170,79198,Paizay-le-Chapt,79,,,791980000F0882,,,,,,,,,,,,,0,,,,,S,sols,,,41,-0.179029,46.084302
2021-1355164,2021-04-02,000001,Vente,124000,6,,RTE D'AUBIGNE,0022,79170,79198,Paizay-le-Chapt,79,,,791980000F0231,,,,,,,,,,,,,0,1,Maison,118,5,S,sols,,,835,-0.177493,46.082313
2021-1355177,2021-04-01,000001,Vente,1000,,,LA GRIFFIERE,B068,79170,79198,Paizay-le-Chapt,79,,,791980000B0402,,,,,,,,,,,,,0,,,,,BT,taillis simples,,,4136,-0.160466,46.062188
2021-1355177,2021-04-01,000001,Vente,1000,,,TERREFORT,B137,79170,79198,Paizay-le-Chapt,79,,,791980000C0115,,,,,,,,,,,,,0,,,,,BT,taillis simples,,,8877,-0.165419,46.059575
2021-1355178,2021-04-09,000001,Vente,1,,,LE BOURG,B013,79170,79198,Paizay-le-Chapt,79,,,791980000F0216,,,,,,,,,,,,,0,,,,,J,jardins,,,698,-0.176041,46.082867
2021-1355966,2021-04-27,000001,Vente,104400,4,,IMP DE LA GRENOUILLERE,0082,79170,79198,Paizay-le-Chapt,79,,,791980000F0239,,,,,,,,,,,,,0,1,Maison,133,5,S,sols,,,303,-0.178546,46.082288
2021-1355966,2021-04-27,000001,Vente,104400,,,LE BOURG,B013,79170,79198,Paizay-le-Chapt,79,,,791980000F0250,,,,,,,,,,,,,0,,,,,J,jardins,,,609,-0.178497,46.081859
2021-1357575,2021-06-14,000001,Vente,750,,,LE BOURG,B013,79170,79198,Paizay-le-Chapt,79,,,791980000F0737,,,,,,,,,,,,,0,,,,,J,jardins,,,611,-0.175752,46.083296
2021-1357577,2021-06-14,000001,Vente,750,,,LE BOURG,B013,79170,79198,Paizay-le-Chapt,79,,,791980000F0738,,,,,,,,,,,,,0,,,,,J,jardins,,,612,-0.175518,46.083216
2021-1357827,2021-06-08,000001,Vente,60000,4,,RUE DU SOMMET LE CUL,0156,79170,79198,Paizay-le-Chapt,79,,,791980000C0396,,,,,,,,,,,,,0,1,Maison,232,5,S,sols,,,660,-0.187341,46.061517
2021-1357827,2021-06-08,000001,Vente,60000,,,LE CUL,B048,79170,79198,Paizay-le-Chapt,79,,,791980000C0660,,,,,,,,,,,,,0,,,,,T,terres,,,446,-0.187401,46.061775
2021-1358172,2021-06-23,000001,Vente,61758,,,SEMOUSSAIS,B133,79170,79198,Paizay-le-Chapt,79,,,791980000B0182,,,,,,,,,,,,,0,,,,,T,terres,,,2100,-0.154421,46.071369
2021-1358172,2021-06-23,000001,Vente,61758,,,SEMOUSSAIS,B133,79170,79198,Paizay-le-Chapt,79,,,791980000B0196,,,,,,,,,,,,,0,,,,,T,terres,,,3417,-0.152293,46.072816
2021-1358172,2021-06-23,000001,Vente,61758,,,SEMOUSSAIS,B133,79170,79198,Paizay-le-Chapt,79,,,791980000B0506,,,,,,,,,,,,,0,,,,,T,terres,,,3301,-0.156647,46.071177
2021-1358172,2021-06-23,000001,Vente,61758,,,LA TERRAGERIE NORD,B135,79170,79198,Paizay-le-Chapt,79,,,79198000ZH0045,,,,,,,,,,,,,0,,,,,T,terres,,,17120,-0.14976,46.075204
2021-1358172,2021-06-23,000001,Vente,61758,,,BOISSELAGE,B012,79170,79198,Paizay-le-Chapt,79,,,79198000ZI0041,,,,,,,,,,,,,0,,,,,T,terres,,,31650,-0.163282,46.073004
2021-1358172,2021-06-23,000001,Vente,61758,,,TOUCHEREAU,B147,79170,79198,Paizay-le-Chapt,79,,,79198000ZK0032,,,,,,,,,,,,,0,,,,,T,terres,,,22080,-0.165456,46.067677
2021-1358174,2021-06-23,000001,Vente,133000,,,LE CUL,B048,79170,79198,Paizay-le-Chapt,79,,,791980000C0652,,,,,,,,,,,,,0,,,,,S,sols,,,55,-0.184677,46.062978
2021-1358174,2021-06-23,000001,Vente,133000,2,,CHE D AUBIGNE  LE CUL,0023,79170,79198,Paizay-le-Chapt,79,,,791980000C0665,,,,,,,,,,,,,0,1,Maison,174,9,S,sols,,,1349,-0.184312,46.062828
2021-1358174,2021-06-23,000001,Vente,133000,2,,CHE D AUBIGNE  LE CUL,0023,79170,79198,Paizay-le-Chapt,79,,,791980000C0665,,,,,,,,,,,,,0,3,Dépendance,,0,S,sols,,,1349,-0.184312,46.062828
2021-1358174,2021-06-23,000001,Vente,133000,,,LE CUL,B048,79170,79198,Paizay-le-Chapt,79,,,791980000C0666,,,,,,,,,,,,,0,,,,,S,sols,,,68,-0.184595,46.062985
2021-1358174,2021-06-23,000001,Vente,133000,,,L OUCHE DU MUR,B090,79170,79198,Paizay-le-Chapt,79,,,79198000ZL0049,,,,,,,,,,,,,0,,,,,T,terres,,,9,-0.184134,46.062634
2021-1358174,2021-06-23,000001,Vente,133000,,,L OUCHE DU MUR,B090,79170,79198,Paizay-le-Chapt,79,,,79198000ZL0050,,,,,,,,,,,,,0,,,,,T,terres,,,216,-0.184111,46.062989
2021-1359014,2021-07-15,000001,Vente,138500,,,LA GRANDE CLIE,B062,79170,79198,Paizay-le-Chapt,79,,,79198000ZC0113,,,,,,,,,,,,,0,,,,,T,terres,,,121,-0.169269,46.093187
2021-1359014,2021-07-15,000001,Vente,138500,,,LA GRANDE CLIE,B062,79170,79198,Paizay-le-Chapt,79,,,79198000ZC0114,,,,,,,,,,,,,0,,,,,T,terres,,,414,-0.169141,46.09312
2021-1359014,2021-07-15,000001,Vente,138500,,,PUY BOLAIN,B120,79170,79198,Paizay-le-Chapt,79,,,79198000ZE0076,,,,,,,,,,,,,0,,,,,S,sols,,,29,-0.167527,46.093231
2021-1359014,2021-07-15,000001,Vente,138500,1,,RUE DE LA POMPE PUY BOLAIN,0129,79170,79198,Paizay-le-Chapt,79,,,79198000ZE0077,,,,,,,,,,,,,0,3,Dépendance,,0,S,sols,,,825,-0.167288,46.093218
2021-1359014,2021-07-15,000001,Vente,138500,1,,RUE DE LA POMPE PUY BOLAIN,0129,79170,79198,Paizay-le-Chapt,79,,,79198000ZE0077,,,,,,,,,,,,,0,1,Maison,80,3,S,sols,,,825,-0.167288,46.093218
2021-1359014,2021-07-15,000001,Vente,138500,1,,RUE DE LA POMPE PUY BOLAIN,0129,79170,79198,Paizay-le-Chapt,79,,,79198000ZE0077,,,,,,,,,,,,,0,1,Maison,131,5,S,sols,,,825,-0.167288,46.093218
2021-1359448,2021-07-20,000001,Vente,3780,,,VALLEE DE L ECOPEAU,B153,79170,79198,Paizay-le-Chapt,79,,,791980000C0511,,,,,,,,,,,,,0,,,,,BT,taillis simples,,,6739,-0.189179,46.054526
2021-1359448,2021-07-20,000001,Vente,3780,,,VALLEE DE L ECOPEAU,B153,79170,79198,Paizay-le-Chapt,79,,,791980000C0517,,,,,,,,,,,,,0,,,,,BT,taillis simples,,,5040,-0.191147,46.054568
2021-1359448,2021-07-20,000001,Vente,3780,,,VALLEE DE L ECOPEAU,B153,79170,79198,Paizay-le-Chapt,79,,,791980000C0518,,,,,,,,,,,,,0,,,,,BT,taillis simples,,,4445,-0.191919,46.054498
2021-1362285,2021-10-05,000001,Vente,89000,,,LES CHOTARDS,B039,79170,79198,Paizay-le-Chapt,79,,,791980000D0050,,,,,,,,,,,,,0,,,,,BT,taillis simples,,,3900,-0.197754,46.057125
2021-1363495,2021-11-18,000001,Vente,118000,,,LE DAUGAT,B049,79170,79198,Paizay-le-Chapt,79,,,79198000ZD0071,,,,,,,,,,,,,0,,,,,S,sols,,,606,-0.170039,46.079029
2021-1363495,2021-11-18,000001,Vente,118000,,,LE DAUGAT,B049,79170,79198,Paizay-le-Chapt,79,,,79198000ZD0071,,,,,,,,,,,,,0,,,,,J,jardins,,,906,-0.170039,46.079029
2021-1363495,2021-11-18,000001,Vente,118000,5155,,BAUDON,B004,79170,79198,Paizay-le-Chapt,79,,,79198000ZD0072,,,,,,,,,,,,,0,1,Maison,65,2,J,jardins,,,808,-0.169865,46.079268
2021-1363495,2021-11-18,000001,Vente,118000,5155,,BAUDON,B004,79170,79198,Paizay-le-Chapt,79,,,79198000ZD0072,,,,,,,,,,,,,0,1,Maison,65,2,S,sols,,,706,-0.169865,46.079268
2021-1364805,2021-12-27,000001,Vente,4000,5200,,RUE DES EPINETTES  RE,0067,79170,79198,Paizay-le-Chapt,79,,,791980000E0089,,,,,,,,,,,,,0,3,Dépendance,,0,S,sols,,,209,-0.194996,46.077094
2021-1364869,2021-12-23,000001,Vente,2500,,,RE,B121,79170,79198,Paizay-le-Chapt,79,,,791980000E0097,,,,,,,,,,,,,0,,,,,J,jardins,,,462,-0.196762,46.077061
2021-1364869,2021-12-23,000001,Vente,2500,,,RE,B121,79170,79198,Paizay-le-Chapt,79,,,791980000E0554,,,,,,,,,,,,,0,,,,,T,terres,,,1190,-0.197009,46.076894
2021-1364869,2021-12-23,000001,Vente,2500,,,RE,B121,79170,79198,Paizay-le-Chapt,79,,,791980000E0555,,,,,,,,,,,,,0,,,,,T,terres,,,241,-0.196966,46.077009
2021-1364869,2021-12-23,000001,Vente,2500,,,RE,B121,79170,79198,Paizay-le-Chapt,79,,,791980000E0557,,,,,,,,,,,,,0,,,,,T,terres,,,8,-0.196665,46.076889
