id_mutation,date_mutation,numero_disposition,nature_mutation,valeur_fonciere,adresse_numero,adresse_suffixe,adresse_nom_voie,adresse_code_voie,code_postal,code_commune,nom_commune,code_departement,ancien_code_commune,ancien_nom_commune,id_parcelle,ancien_id_parcelle,numero_volume,lot1_numero,lot1_surface_carrez,lot2_numero,lot2_surface_carrez,lot3_numero,lot3_surface_carrez,lot4_numero,lot4_surface_carrez,lot5_numero,lot5_surface_carrez,nombre_lots,code_type_local,type_local,surface_reelle_bati,nombre_pieces_principales,code_nature_culture,nature_culture,code_nature_culture_speciale,nature_culture_speciale,surface_terrain,longitude,latitude
2021-1353255,2021-01-22,000001,Vente,800,,,LES MAISONS,B076,79120,79297,Sainte-Soline,79,,,79297000ZT0013,,,,,,,,,,,,,0,,,,,P,prés,,,825,0.030005,46.239225
2021-1353257,2021-01-29,000001,Vente,64000,1,,CHEM DE SAINT ELOI,0121,79120,79297,Sainte-Soline,79,,,79297000ZR0078,,,,,,,,,,,,,0,1,Maison,100,5,S,sols,,,1106,0.026039,46.231564
2021-1353257,2021-01-29,000001,Vente,64000,,,ST ELOI,B132,79120,79297,Sainte-Soline,79,,,79297000ZR0080,,,,,,,,,,,,,0,,,,,T,terres,,,2217,0.025945,46.23117
2021-1353860,2021-02-26,000001,Vente,148000,10,,RUE DE LA CHAPELLE BONNEUIL,0018,79120,79297,Sainte-Soline,79,,,79297000AB0011,,,,,,,,,,,,,0,1,Maison,170,7,S,sols,,,1243,0.047995,46.274896
2021-1353860,2021-02-26,000001,Vente,148000,8,,RUE DE LA CHAPELLE BONNEUIL,0018,79120,79297,Sainte-Soline,79,,,79297000AB0015,,,,,,,,,,,,,0,,,,,S,sols,,,887,0.048273,46.274946
2021-1353860,2021-02-26,000001,Vente,148000,,,BONNEUIL,B010,79120,79297,Sainte-Soline,79,,,79297000AB0178,,,,,,,,,,,,,0,,,,,S,sols,,,4,0.048189,46.274749
2021-1355604,2021-04-13,000001,Vente,2000,,,LES GRANDES ROUCHES,B061,79120,79297,Sainte-Soline,79,,,79297000AH0082,,,,,,,,,,,,,0,,,,,P,prés,,,10135,0.028757,46.266235
2021-1356217,2021-05-12,000001,Vente,1000,,,PRE CLOUX,B115,79120,79297,Sainte-Soline,79,,,79297000ZW0092,,,,,,,,,,,,,0,,,,,J,jardins,,,2495,0.032354,46.245634
2021-1356243,2021-04-30,000001,Vente,80000,,,BONNEUIL,B010,79120,79297,Sainte-Soline,79,,,79297000AB0032,,,,,,,,,,,,,0,,,,,J,jardins,,,2608,0.050277,46.275418
2021-1356243,2021-04-30,000001,Vente,80000,9,,RUE DU PALAIS BONNEUIL,0103,79120,79297,Sainte-Soline,79,,,79297000AB0033,,,,,,,,,,,,,0,1,Maison,70,2,S,sols,,,1793,0.050243,46.275059
2021-1356243,2021-04-30,000001,Vente,80000,9,,RUE DU PALAIS BONNEUIL,0103,79120,79297,Sainte-Soline,79,,,79297000AB0033,,,,,,,,,,,,,0,3,Dépendance,,0,S,sols,,,1793,0.050243,46.275059
2021-1356243,2021-04-30,000001,Vente,80000,9,,RUE DU PALAIS BONNEUIL,0103,79120,79297,Sainte-Soline,79,,,79297000AB0033,,,,,,,,,,,,,0,3,Dépendance,,0,S,sols,,,1793,0.050243,46.275059
2021-1356243,2021-04-30,000001,Vente,80000,9,,RUE DU PALAIS BONNEUIL,0103,79120,79297,Sainte-Soline,79,,,79297000AB0033,,,,,,,,,,,,,0,3,Dépendance,,0,S,sols,,,1793,0.050243,46.275059
2021-1356291,2021-04-26,000001,Vente,171000,,,VERRINES,B139,79120,79297,Sainte-Soline,79,,,79297000AC0012,,,,,,,,,,,,,0,,,,,S,sols,,,27,0.072532,46.272191
2021-1356564,2021-05-20,000001,Vente,4090,,,PRAIRIE DE L ILEAU,B103,79120,79297,Sainte-Soline,79,,,79297000ZW0131,,,,,,,,,,,,,0,,,,,P,prés,,,11686,0.021815,46.253049
2021-1357372,2021-05-21,000001,Vente,143950,,,LE BOURG,B012,79120,79297,Sainte-Soline,79,,,79297000AE0083,,,,,,,,,,,,,0,,,,,S,sols,,,535,0.040829,46.248232
2021-1357372,2021-05-21,000001,Vente,143950,39,,RUE DES GRANGES,0072,79120,79297,Sainte-Soline,79,,,79297000AE0227,,,,,,,,,,,,,0,1,Maison,105,5,S,sols,,,730,0.040827,46.248005
2021-1357372,2021-05-21,000001,Vente,143950,39,,RUE DES GRANGES,0072,79120,79297,Sainte-Soline,79,,,79297000AE0227,,,,,,,,,,,,,0,3,Dépendance,,0,S,sols,,,730,0.040827,46.248005
2021-1357372,2021-05-21,000001,Vente,143950,,,LE BOURG,B012,79120,79297,Sainte-Soline,79,,,79297000AE0296,,,,,,,,,,,,,0,,,,,T,terres,,,1647,0.041229,46.248343
2021-1358973,2021-07-05,000001,Vente,8000,,,LES GENETS,B051,79120,79297,Sainte-Soline,79,,,79297000ZD0006,,,,,,,,,,,,,0,,,,,T,terres,,,16040,0.050109,46.267248
2021-1359272,2021-07-19,000001,Vente,100000,9,,RUE DU LOT D'AUNIS,0004,79120,79297,Sainte-Soline,79,,,79297000ZT0129,,,,,,,,,,,,,0,1,Maison,115,6,S,sols,,,1170,0.040021,46.243497
2021-1359799,2021-07-29,000001,Vente,104500,24,,RUE DES GRANGES,0072,79120,79297,Sainte-Soline,79,,,79297000AE0253,,,,,,,,,,,,,0,1,Maison,119,4,S,sols,,,1530,0.039428,46.247149
2021-1359799,2021-07-29,000001,Vente,104500,24,,RUE DES GRANGES,0072,79120,79297,Sainte-Soline,79,,,79297000AE0253,,,,,,,,,,,,,0,1,Maison,119,4,J,jardins,,,670,0.039428,46.247149
2021-1360375,2021-08-17,000001,Vente,10500,,,LE MARAIS,B078,79120,79297,Sainte-Soline,79,,,79297000ZX0013,,,,,,,,,,,,,0,,,,,T,terres,,,9796,0.032953,46.264065
2021-1360377,2021-08-17,000001,Vente,7300,,,LA VALLEE DEVOUE,B136,79120,79297,Sainte-Soline,79,,,79297000ZA0026,,,,,,,,,,,,,0,,,,,BT,taillis simples,,,678,0.042503,46.275613
2021-1360377,2021-08-17,000001,Vente,7300,,,PRAIRIE DE MORTEFONDS,B108,79120,79297,Sainte-Soline,79,,,79297000ZK0031,,,,,,,,,,,,,0,,,,,T,terres,,,2924,0.047031,46.261921
2021-1360377,2021-08-17,000001,Vente,7300,,,PRAIRIE DE MORTEFONDS,B108,79120,79297,Sainte-Soline,79,,,79297000ZK0031,,,,,,,,,,,,,0,,,,,T,terres,,,11694,0.047031,46.261921
2021-1360377,2021-08-17,000001,Vente,7300,,,PRAIRIE DE MORTEFONDS,B108,79120,79297,Sainte-Soline,79,,,79297000ZK0032,,,,,,,,,,,,,0,,,,,T,terres,,,10040,0.047566,46.261255
2021-1360377,2021-08-17,000001,Vente,7300,,,PRAIRIE DE MORTEFONDS,B108,79120,79297,Sainte-Soline,79,,,79297000ZK0032,,,,,,,,,,,,,0,,,,,T,terres,,,2511,0.047566,46.261255
2021-1361439,2021-09-15,000001,Vente,78000,10,,RUE DE LA DIVE,0033,79120,79297,Sainte-Soline,79,,,79297000AE0026,,,,,,,,,,,,,0,3,Dépendance,,0,S,sols,,,1073,0.035791,46.245931
2021-1361439,2021-09-15,000001,Vente,78000,10,,RUE DE LA DIVE,0033,79120,79297,Sainte-Soline,79,,,79297000AE0026,,,,,,,,,,,,,0,3,Dépendance,,0,S,sols,,,1073,0.035791,46.245931
2021-1361439,2021-09-15,000001,Vente,78000,10,,RUE DE LA DIVE,0033,79120,79297,Sainte-Soline,79,,,79297000AE0026,,,,,,,,,,,,,0,1,Maison,115,4,S,sols,,,1073,0.035791,46.245931
2021-1361561,2021-09-21,000001,Vente,17100,,,LES VALANDREES,B135,79120,79297,Sainte-Soline,79,,,79297000ZI0038,,,,,,,,,,,,,0,,,,,T,terres,,,21414,0.068093,46.250306
2021-1361561,2021-09-21,000001,Vente,17100,,,LES VALANDREES,B135,79120,79297,Sainte-Soline,79,,,79297000ZI0038,,,,,,,,,,,,,0,,,,,T,terres,,,21414,0.068093,46.250306
2021-1361899,2021-10-01,000001,Vente,12900,,,LES JARRIES,B072,79120,79297,Sainte-Soline,79,,,79297000ZM0047,,,,,,,,,,,,,0,,,,,T,terres,,,21284,0.07565,46.24159
2021-1361899,2021-10-01,000001,Vente,12900,,,LES JARRIES,B072,79120,79297,Sainte-Soline,79,,,79297000ZM0048,,,,,,,,,,,,,0,,,,,T,terres,,,9439,0.07488,46.24149
2021-1362674,2021-10-22,000001,Vente,9300,,,LA FLOTTE,B046,79120,79297,Sainte-Soline,79,,,79297000ZV0027,,,,,,,,,,,,,0,,,,,T,terres,,,3950,0.021296,46.249596
2021-1362674,2021-10-22,000001,Vente,9300,,,LA FLOTTE,B046,79120,79297,Sainte-Soline,79,,,79297000ZV0027,,,,,,,,,,,,,0,,,,,T,terres,,,3951,0.021296,46.249596
2021-1363103,2021-11-19,000001,Vente,147050,5,,CHEM DES ERABLES VERRINES,0054,79120,79297,Sainte-Soline,79,,,79297000AC0081,,,,,,,,,,,,,0,3,Dépendance,,0,S,sols,,,358,0.073909,46.26936
2021-1363103,2021-11-19,000001,Vente,147050,5,,CHEM DES ERABLES VERRINES,0054,79120,79297,Sainte-Soline,79,,,79297000AC0081,,,,,,,,,,,,,0,1,Maison,138,5,S,sols,,,358,0.073909,46.26936
2021-1363103,2021-11-19,000001,Vente,147050,5,,CHEM DES ERABLES VERRINES,0054,79120,79297,Sainte-Soline,79,,,79297000AC0081,,,,,,,,,,,,,0,3,Dépendance,,0,S,sols,,,358,0.073909,46.26936
2021-1363103,2021-11-19,000001,Vente,147050,,,VERRINES,B139,79120,79297,Sainte-Soline,79,,,79297000AC0084,,,,,,,,,,,,,0,,,,,S,sols,,,18,0.073811,46.269346
2021-1363103,2021-11-19,000001,Vente,147050,,,VERRINES,B139,79120,79297,Sainte-Soline,79,,,79297000AC0089,,,,,,,,,,,,,0,,,,,S,sols,,,563,0.07419,46.269293
2021-1363734,2021-11-29,000001,Vente,600,,,PRAIRIE DU BIGNON,B110,79120,79297,Sainte-Soline,79,,,79297000ZP0033,,,,,,,,,,,,,0,,,,,P,prés,,,4073,0.034896,46.217676
2021-1363858,2021-12-02,000001,Vente,15000,,,CHAMPS DE ST MAIXENT,B028,79120,79297,Sainte-Soline,79,,,79297000ZC0071,,,,,,,,,,,,,0,,,,,T,terres,,,11809,0.053285,46.270601
2021-1363858,2021-12-02,000001,Vente,15000,,,CHAMPS DE ST MAIXENT,B028,79120,79297,Sainte-Soline,79,,,79297000ZC0071,,,,,,,,,,,,,0,,,,,T,terres,,,11808,0.053285,46.270601
2021-1363858,2021-12-02,000001,Vente,15000,,,CHAMPS DE ST MAIXENT,B028,79120,79297,Sainte-Soline,79,,,79297000ZC0072,,,,,,,,,,,,,0,,,,,T,terres,,,3678,0.053203,46.27159
2021-1363858,2021-12-02,000001,Vente,15000,,,CHAMPS DE ST MAIXENT,B028,79120,79297,Sainte-Soline,79,,,79297000ZC0072,,,,,,,,,,,,,0,,,,,T,terres,,,3679,0.053203,46.27159
2021-1363864,2021-12-02,000001,Vente,4500,,,PRAIRIE DE MORTEFONDS,B108,79120,79297,Sainte-Soline,79,,,79297000ZK0034,,,,,,,,,,,,,0,,,,,T,terres,,,13085,0.048952,46.261014
2021-1363899,2021-12-02,000001,Vente,45500,,,LES GROIES DE VERRINES,B068,79120,79297,Sainte-Soline,79,,,79297000ZB0094,,,,,,,,,,,,,0,,,,,T,terres,,,13069,0.060584,46.27641
2021-1363899,2021-12-02,000001,Vente,45500,,,LES GROIES DE VERRINES,B068,79120,79297,Sainte-Soline,79,,,79297000ZB0094,,,,,,,,,,,,,0,,,,,T,terres,,,11392,0.060584,46.27641
2021-1363899,2021-12-02,000001,Vente,45500,,,LES GROIES DE VERRINES,B068,79120,79297,Sainte-Soline,79,,,79297000ZB0094,,,,,,,,,,,,,0,,,,,T,terres,,,11392,0.060584,46.27641
2021-1363899,2021-12-02,000001,Vente,45500,,,LES GROIES DE VERRINES,B068,79120,79297,Sainte-Soline,79,,,79297000ZB0096,,,,,,,,,,,,,0,,,,,T,terres,,,28249,0.057969,46.276219
2021-1363899,2021-12-02,000001,Vente,45500,,,LES GROIES DE VERRINES,B068,79120,79297,Sainte-Soline,79,,,79297000ZB0096,,,,,,,,,,,,,0,,,,,T,terres,,,28249,0.057969,46.276219
2021-1363899,2021-12-02,000001,Vente,45500,,,LES GROIES DE VERRINES,B068,79120,79297,Sainte-Soline,79,,,79297000ZB0096,,,,,,,,,,,,,0,,,,,T,terres,,,28248,0.057969,46.276219
2021-1363914,2021-11-30,000001,Vente,110000,1,,RUE DE LA FAIDIVERIE ASNIERES,0060,79120,79297,Sainte-Soline,79,,,79297000AD0204,,,,,,,,,,,,,0,1,Maison,145,4,S,sols,,,585,0.08407,46.250053
2021-1364044,2021-11-22,000001,Vente,100000,61,,RUE DE LA CHAPELLE BONNEUIL,0018,79120,79297,Sainte-Soline,79,,,79297000ZA0106,,,,,,,,,,,,,0,1,Maison,124,5,T,terres,,,1771,0.041681,46.273671
2021-1364044,2021-11-22,000001,Vente,100000,61,,RUE DE LA CHAPELLE BONNEUIL,0018,79120,79297,Sainte-Soline,79,,,79297000ZA0106,,,,,,,,,,,,,0,1,Maison,124,5,S,sols,,,1500,0.041681,46.273671
2021-1364044,2021-11-22,000001,Vente,100000,,,CINQ SAUTS,B036,79120,79297,Sainte-Soline,79,,,79297000ZA0111,,,,,,,,,,,,,0,,,,,S,sols,,,135,0.04137,46.273718
2021-1364044,2021-11-22,000001,Vente,100000,,,CINQ SAUTS,B036,79120,79297,Sainte-Soline,79,,,79297000ZA0113,,,,,,,,,,,,,0,,,,,S,sols,,,82,0.041215,46.273382
2021-1364262,2021-11-29,000001,Vente,63000,18,,CHEM DE CHAMPRIMBAULT,0013,79120,79297,Sainte-Soline,79,,,79297000ZV0098,,,,,,,,,,,,,0,1,Maison,132,5,S,sols,,,465,0.023518,46.242581
2021-1364262,2021-11-29,000001,Vente,63000,,,CHAMPRIMBAULT,B026,79120,79297,Sainte-Soline,79,,,79297000ZV0103,,,,,,,,,,,,,0,,,,,J,jardins,,,1170,0.024274,46.243036
2021-1364262,2021-11-29,000001,Vente,63000,,,CHAMPRIMBAULT,B026,79120,79297,Sainte-Soline,79,,,79297000ZV0123,,,,,,,,,,,,,0,,,,,S,sols,,,99,0.024164,46.243107
2021-1364262,2021-11-29,000001,Vente,63000,,,CHAMPRIMBAULT,B026,79120,79297,Sainte-Soline,79,,,79297000ZV0140,,,,,,,,,,,,,0,,,,,S,sols,,,720,0.023087,46.242458
2021-1364291,2021-12-20,000001,Vente,85000,24,,RUE DES ECUREUILS ASNIERES,0044,79120,79297,Sainte-Soline,79,,,79297000AD0236,,,,,,,,,,,,,0,1,Maison,105,4,S,sols,,,1429,0.080928,46.250645
2021-1364291,2021-12-20,000001,Vente,85000,,,RUE DES ECUREUILS ASNIERES,0044,79120,79297,Sainte-Soline,79,,,79297000AD0237,,,,,,,,,,,,,0,,,,,S,sols,,,168,0.081242,46.25063
2021-1364855,2021-12-24,000001,Vente,140000,35,,RUE DES GRANGES,0072,79120,79297,Sainte-Soline,79,,,79297000AE0290,,,,,,,,,,,,,0,1,Maison,125,5,S,sols,,,719,0.040327,46.247916
2021-1364855,2021-12-24,000001,Vente,140000,35,,RUE DES GRANGES,0072,79120,79297,Sainte-Soline,79,,,79297000AE0290,,,,,,,,,,,,,0,3,Dépendance,,0,S,sols,,,719,0.040327,46.247916
