id_mutation,date_mutation,numero_disposition,nature_mutation,valeur_fonciere,adresse_numero,adresse_suffixe,adresse_nom_voie,adresse_code_voie,code_postal,code_commune,nom_commune,code_departement,ancien_code_commune,ancien_nom_commune,id_parcelle,ancien_id_parcelle,numero_volume,lot1_numero,lot1_surface_carrez,lot2_numero,lot2_surface_carrez,lot3_numero,lot3_surface_carrez,lot4_numero,lot4_surface_carrez,lot5_numero,lot5_surface_carrez,nombre_lots,code_type_local,type_local,surface_reelle_bati,nombre_pieces_principales,code_nature_culture,nature_culture,code_nature_culture_speciale,nature_culture_speciale,surface_terrain,longitude,latitude
2021-1352495,2021-01-11,000001,Vente,30000,2,,RTE DE LA SERVELIERE,0055,79420,79340,Vausseroux,79,,,79340000AA0071,,,,,,,,,,,,,0,,,,,J,jardins,,,965,-0.135384,46.551492
2021-1352495,2021-01-11,000001,Vente,30000,2,,RTE DE LA SERVELIERE,0055,79420,79340,Vausseroux,79,,,79340000AA0071,,,,,,,,,,,,,0,,,,,S,sols,,,1100,-0.135384,46.551492
2021-1353367,2021-01-25,000001,Vente,30000,,,LONGRUERE EST,B035,79420,79340,Vausseroux,79,,,793400000C0057,,,,,,,,,,,,,0,,,,,P,prés,,,4400,-0.127044,46.569661
2021-1353367,2021-01-25,000001,Vente,30000,,,LONGRUERE EST,B035,79420,79340,Vausseroux,79,,,793400000C0057,,,,,,,,,,,,,0,,,,,E,eaux,MARE,Mare,1450,-0.127044,46.569661
2021-1353367,2021-01-25,000001,Vente,30000,,,LONGRUERE EST,B035,79420,79340,Vausseroux,79,,,793400000C0057,,,,,,,,,,,,,0,,,,,E,eaux,ETANG,Etangs,4350,-0.127044,46.569661
2021-1354881,2021-03-19,000001,Vente,750,5098,,LA FONZILLE,B029,79420,79340,Vausseroux,79,,,793400000D0255,,,,,,,,,,,,,0,1,Maison,91,1,S,sols,,,137,-0.115151,46.529433
2021-1355931,2021-04-19,000001,Vente,51000,,,LA PRAIRIE,B051,79420,79340,Vausseroux,79,,,793400000D0031,,,,,,,,,,,,,0,,,,,T,terres,,,10730,-0.125625,46.541103
2021-1355931,2021-04-19,000001,Vente,51000,,,LA PRAIRIE,B051,79420,79340,Vausseroux,79,,,793400000D0031,,,,,,,,,,,,,0,,,,,S,sols,,,200,-0.125625,46.541103
2021-1355931,2021-04-19,000001,Vente,51000,5082,,LA PRAIRIE,B051,79420,79340,Vausseroux,79,,,793400000D0032,,,,,,,,,,,,,0,1,Maison,48,1,S,sols,,,640,-0.124554,46.541011
2021-1355931,2021-04-19,000001,Vente,51000,,,LA PRAIRIE,B051,79420,79340,Vausseroux,79,,,793400000D0033,,,,,,,,,,,,,0,,,,,J,jardins,,,590,-0.124809,46.54071
2021-1355931,2021-04-19,000001,Vente,51000,5083,,LA PRAIRIE,B051,79420,79340,Vausseroux,79,,,793400000D0592,,,,,,,,,,,,,0,1,Maison,72,3,S,sols,,,1130,-0.12496,46.540868
2021-1355931,2021-04-19,000001,Vente,51000,,,LA PRAIRIE,B051,79420,79340,Vausseroux,79,,,793400000D0593,,,,,,,,,,,,,0,,,,,J,jardins,,,735,-0.124974,46.540744
2021-1357493,2021-06-22,000001,Vente,15500,1,,RTE DES CARRIOTIERES,0010,79420,79340,Vausseroux,79,,,79340000AA0005,,,,,,,,,,,,,0,3,Dépendance,,0,S,sols,,,807,-0.138211,46.54907
2021-1357493,2021-06-22,000001,Vente,15500,1,,RTE DES CARRIOTIERES,0010,79420,79340,Vausseroux,79,,,79340000AA0005,,,,,,,,,,,,,0,3,Dépendance,,0,S,sols,,,807,-0.138211,46.54907
2021-1357493,2021-06-22,000001,Vente,15500,1,,RTE DES CARRIOTIERES,0010,79420,79340,Vausseroux,79,,,79340000AA0005,,,,,,,,,,,,,0,3,Dépendance,,0,BP,peupleraies,,,6500,-0.138211,46.54907
2021-1357493,2021-06-22,000001,Vente,15500,1,,RTE DES CARRIOTIERES,0010,79420,79340,Vausseroux,79,,,79340000AA0005,,,,,,,,,,,,,0,3,Dépendance,,0,S,sols,,,807,-0.138211,46.54907
2021-1357493,2021-06-22,000001,Vente,15500,1,,RTE DES CARRIOTIERES,0010,79420,79340,Vausseroux,79,,,79340000AA0005,,,,,,,,,,,,,0,3,Dépendance,,0,BP,peupleraies,,,6500,-0.138211,46.54907
2021-1357493,2021-06-22,000001,Vente,15500,1,,RTE DES CARRIOTIERES,0010,79420,79340,Vausseroux,79,,,79340000AA0005,,,,,,,,,,,,,0,3,Dépendance,,0,BP,peupleraies,,,6500,-0.138211,46.54907
2021-1357493,2021-06-22,000001,Vente,15500,1,,RTE DES CARRIOTIERES,0010,79420,79340,Vausseroux,79,,,79340000AA0005,,,,,,,,,,,,,0,3,Dépendance,,0,S,sols,,,807,-0.138211,46.54907
2021-1357493,2021-06-22,000001,Vente,15500,1,,RTE DES CARRIOTIERES,0010,79420,79340,Vausseroux,79,,,79340000AA0005,,,,,,,,,,,,,0,3,Dépendance,,0,BP,peupleraies,,,6500,-0.138211,46.54907
2021-1357914,2021-06-14,000001,Vente,21000,,,LA FONZILLE,B029,79420,79340,Vausseroux,79,,,793400000D0270,,,,,,,,,,,,,0,,,,,S,sols,,,55,-0.115484,46.529287
2021-1357914,2021-06-14,000001,Vente,21000,,,LA FONZILLE,B029,79420,79340,Vausseroux,79,,,793400000D0271,,,,,,,,,,,,,0,,,,,S,sols,,,65,-0.115518,46.52913
2021-1357914,2021-06-14,000001,Vente,21000,,,LA FONZILLE,B029,79420,79340,Vausseroux,79,,,793400000D0279,,,,,,,,,,,,,0,,,,,T,terres,,,223,-0.116227,46.528808
2021-1357914,2021-06-14,000001,Vente,21000,,,LA FONZILLE,B029,79420,79340,Vausseroux,79,,,793400000D0281,,,,,,,,,,,,,0,,,,,J,jardins,,,665,-0.116677,46.528642
2021-1357914,2021-06-14,000001,Vente,21000,5201,,LA FONZILLE,B029,79420,79340,Vausseroux,79,,,793400000D0679,,,,,,,,,,,,,0,1,Maison,50,1,S,sols,,,604,-0.115502,46.529268
2021-1358241,2021-06-21,000001,Vente,1750,,,L AVENEAU,B004,79420,79340,Vausseroux,79,,,793400000C0264,,,,,,,,,,,,,0,,,,,T,terres,,,5155,-0.10983,46.545525
2021-1358243,2021-06-21,000001,Vente,140000,2,,RTE DE PARTHENAY,0035,79420,79340,Vausseroux,79,,,79340000AA0128,,,,,,,,,,,,,0,3,Dépendance,,0,S,sols,,,1500,-0.139131,46.550073
2021-1358243,2021-06-21,000001,Vente,140000,2,,RTE DE PARTHENAY,0035,79420,79340,Vausseroux,79,,,79340000AA0128,,,,,,,,,,,,,0,3,Dépendance,,0,P,prés,,,3134,-0.139131,46.550073
2021-1358243,2021-06-21,000001,Vente,140000,2,,RTE DE PARTHENAY,0035,79420,79340,Vausseroux,79,,,79340000AA0128,,,,,,,,,,,,,0,1,Maison,128,4,P,prés,,,3134,-0.139131,46.550073
2021-1358243,2021-06-21,000001,Vente,140000,2,,RTE DE PARTHENAY,0035,79420,79340,Vausseroux,79,,,79340000AA0128,,,,,,,,,,,,,0,1,Maison,128,4,S,sols,,,1500,-0.139131,46.550073
2021-1358466,2021-07-19,000001,Vente,47000,,,RTE DE ST MARTIN DU FOUILLOUX,0050,79420,79340,Vausseroux,79,,,79340000AA0109,,,,,,,,,,,,,0,3,Dépendance,,0,S,sols,,,392,-0.137165,46.551278
2021-1358466,2021-07-19,000001,Vente,47000,3,,RTE DE ST MARTIN DU FOUILLOUX,0050,79420,79340,Vausseroux,79,,,79340000AA0110,,,,,,,,,,,,,0,1,Maison,100,4,S,sols,,,114,-0.137131,46.551102
2021-1358466,2021-07-19,000001,Vente,47000,5176,,LE BOURG,B015,79420,79340,Vausseroux,79,,,79340000AA0111,,,1,16,,,,,,,,,1,2,Appartement,7,0,,,,,,-0.137198,46.551104
2021-1359126,2021-07-19,000001,Vente,53000,5103,,LA FONZILLE,B029,79420,79340,Vausseroux,79,,,793400000D0268,,,,,,,,,,,,,0,1,Maison,147,5,S,sols,,,159,-0.115319,46.529318
2021-1359126,2021-07-19,000001,Vente,53000,,,LA FONZILLE,B029,79420,79340,Vausseroux,79,,,793400000D0269,,,,,,,,,,,,,0,,,,,S,sols,,,56,-0.115238,46.529278
2021-1359126,2021-07-19,000001,Vente,53000,,,LA FONZILLE,B029,79420,79340,Vausseroux,79,,,793400000D0274,,,,,,,,,,,,,0,,,,,S,sols,,,555,-0.115926,46.529042
2021-1359126,2021-07-19,000001,Vente,53000,,,LA FONZILLE,B029,79420,79340,Vausseroux,79,,,793400000D0276,,,,,,,,,,,,,0,,,,,T,terres,,,135,-0.115988,46.529249
2021-1359126,2021-07-19,000001,Vente,53000,,,LA FONZILLE,B029,79420,79340,Vausseroux,79,,,793400000D0277,,,,,,,,,,,,,0,,,,,J,jardins,,,1260,-0.11622,46.529086
2021-1359126,2021-07-19,000001,Vente,53000,,,LA FONZILLE,B029,79420,79340,Vausseroux,79,,,793400000D0280,,,,,,,,,,,,,0,,,,,T,terres,,,705,-0.116399,46.528742
2021-1359126,2021-07-19,000001,Vente,53000,,,LA FONZILLE,B029,79420,79340,Vausseroux,79,,,793400000D0280,,,,,,,,,,,,,0,,,,,S,sols,,,326,-0.116399,46.528742
2021-1359126,2021-07-19,000001,Vente,53000,,,LA FONZILLE,B029,79420,79340,Vausseroux,79,,,793400000D0282,,,,,,,,,,,,,0,,,,,T,terres,,,1140,-0.117037,46.528599
2021-1359126,2021-07-19,000001,Vente,53000,,,LA FONZILLE,B029,79420,79340,Vausseroux,79,,,793400000D0292,,,,,,,,,,,,,0,,,,,T,terres,,,3960,-0.117202,46.528831
2021-1359128,2021-07-15,000001,Vente,5000,,,BOUCHETOUS,B014,79420,79340,Vausseroux,79,,,793400000D0114,,,,,,,,,,,,,0,,,,,T,terres,,,521,-0.118999,46.542262
2021-1359128,2021-07-15,000001,Vente,5000,,,BOUCHETOUS,B014,79420,79340,Vausseroux,79,,,793400000D0116,,,,,,,,,,,,,0,,,,,J,jardins,,,730,-0.118693,46.542563
2021-1359128,2021-07-15,000001,Vente,5000,,,BOUCHETOUS,B014,79420,79340,Vausseroux,79,,,793400000D0117,,,,,,,,,,,,,0,,,,,S,sols,,,369,-0.118427,46.54255
2021-1359128,2021-07-15,000001,Vente,5000,,,BOUCHETOUS,B014,79420,79340,Vausseroux,79,,,793400000D0122,,,,,,,,,,,,,0,,,,,S,sols,,,9,-0.118121,46.542487
2021-1359128,2021-07-15,000001,Vente,5000,,,BOUCHETOUS,B014,79420,79340,Vausseroux,79,,,793400000D0124,,,,,,,,,,,,,0,,,,,J,jardins,,,870,-0.117783,46.542683
2021-1359128,2021-07-15,000001,Vente,5000,,,BOUCHETOUS,B014,79420,79340,Vausseroux,79,,,793400000D0125,,,,,,,,,,,,,0,,,,,T,terres,,,308,-0.118325,46.54267
2021-1359128,2021-07-15,000001,Vente,5000,,,BOUCHETOUS,B014,79420,79340,Vausseroux,79,,,793400000D0126,,,,,,,,,,,,,0,,,,,T,terres,,,515,-0.11834,46.542833
2021-1359128,2021-07-15,000001,Vente,5000,,,BOUCHETOUS,B014,79420,79340,Vausseroux,79,,,793400000D0127,,,,,,,,,,,,,0,,,,,T,terres,,,3013,-0.11788,46.542978
2021-1360078,2021-08-06,000001,Vente,330000,,,LA COURBOTTRIE,B025,79420,79340,Vausseroux,79,,,793400000C0111,,,,,,,,,,,,,0,,,,,T,terres,,,18255,-0.117686,46.559333
2021-1360078,2021-08-06,000001,Vente,330000,,,LA COURBOTTRIE,B025,79420,79340,Vausseroux,79,,,793400000C0112,,,,,,,,,,,,,0,,,,,P,prés,,,310,-0.117596,46.557642
2021-1360078,2021-08-06,000001,Vente,330000,,,LA COURBOTTRIE,B025,79420,79340,Vausseroux,79,,,793400000C0113,,,,,,,,,,,,,0,,,,,P,prés,,,9505,-0.118844,46.557702
2021-1360078,2021-08-06,000001,Vente,330000,,,LA COURBOTTRIE,B025,79420,79340,Vausseroux,79,,,793400000C0114,,,,,,,,,,,,,0,,,,,T,terres,,,840,-0.118749,46.558418
2021-1360078,2021-08-06,000001,Vente,330000,,,LA COURBOTTRIE,B025,79420,79340,Vausseroux,79,,,793400000C0115,,,,,,,,,,,,,0,,,,,J,jardins,,,2425,-0.118316,46.558615
2021-1360078,2021-08-06,000001,Vente,330000,,,LA COURBOTTRIE,B025,79420,79340,Vausseroux,79,,,793400000C0120,,,,,,,,,,,,,0,,,,,P,prés,,,21270,-0.119776,46.558901
2021-1360078,2021-08-06,000001,Vente,330000,,,LA COURBOTTRIE,B025,79420,79340,Vausseroux,79,,,793400000C0319,,,,,,,,,,,,,0,,,,,P,prés,,,10835,-0.116008,46.560324
2021-1360078,2021-08-06,000001,Vente,330000,,,LA COURBOTTRIE,B025,79420,79340,Vausseroux,79,,,793400000C0319,,,,,,,,,,,,,0,,,,,P,prés,,,10835,-0.116008,46.560324
2021-1360078,2021-08-06,000001,Vente,330000,,,LA COURBOTTRIE,B025,79420,79340,Vausseroux,79,,,793400000C0320,,,,,,,,,,,,,0,,,,,E,eaux,MARE,Mare,600,-0.117006,46.558479
2021-1360078,2021-08-06,000001,Vente,330000,,,LA COURBOTTRIE,B025,79420,79340,Vausseroux,79,,,793400000C0320,,,,,,,,,,,,,0,,,,,P,prés,,,8063,-0.117006,46.558479
2021-1360078,2021-08-06,000001,Vente,330000,,,LA COURBOTTRIE,B025,79420,79340,Vausseroux,79,,,793400000C0320,,,,,,,,,,,,,0,,,,,P,prés,,,8062,-0.117006,46.558479
2021-1360078,2021-08-06,000001,Vente,330000,5069,,LA COURBOTTRIE,B025,79420,79340,Vausseroux,79,,,793400000C0321,,,,,,,,,,,,,0,3,Dépendance,,0,S,sols,,,5650,-0.11782,46.558221
2021-1360078,2021-08-06,000001,Vente,330000,5069,,LA COURBOTTRIE,B025,79420,79340,Vausseroux,79,,,793400000C0321,,,,,,,,,,,,,0,1,Maison,180,5,S,sols,,,5650,-0.11782,46.558221
2021-1360513,2021-09-03,000001,Vente,25000,,,LONGRUERE EST,B035,79420,79340,Vausseroux,79,,,793400000C0354,,,,,,,,,,,,,0,,,,,T,terres,,,64115,-0.127124,46.567713
2021-1360517,2021-09-09,000001,Vente,184000,5086,,BOUCHETOUS,B014,79420,79340,Vausseroux,79,,,793400000D0794,,,,,,,,,,,,,0,3,Dépendance,,0,S,sols,,,1571,-0.118058,46.54215
2021-1360517,2021-09-09,000001,Vente,184000,5086,,BOUCHETOUS,B014,79420,79340,Vausseroux,79,,,793400000D0794,,,,,,,,,,,,,0,3,Dépendance,,0,S,sols,,,1571,-0.118058,46.54215
2021-1360517,2021-09-09,000001,Vente,184000,5086,,BOUCHETOUS,B014,79420,79340,Vausseroux,79,,,793400000D0794,,,,,,,,,,,,,0,1,Maison,270,5,S,sols,,,1571,-0.118058,46.54215
2021-1361154,2021-09-28,000001,Vente,73000,5064,,LONGRUERE OUEST,B036,79420,79340,Vausseroux,79,,,793400000B0200,,,,,,,,,,,,,0,3,Dépendance,,0,S,sols,,,1440,-0.129935,46.567114
2021-1361154,2021-09-28,000001,Vente,73000,5064,,LONGRUERE OUEST,B036,79420,79340,Vausseroux,79,,,793400000B0200,,,,,,,,,,,,,0,1,Maison,128,4,S,sols,,,1440,-0.129935,46.567114
2021-1361154,2021-09-28,000001,Vente,73000,,,LONGRUERE OUEST,B036,79420,79340,Vausseroux,79,,,793400000B0225,,,,,,,,,,,,,0,,,,,S,sols,,,75,-0.129841,46.567168
2021-1362051,2021-10-21,000001,Vente,265000,,,BOIS DE LA GARDE,B009,79420,79340,Vausseroux,79,,,793400000C0235,,,,,,,,,,,,,0,,,,,BF,futaies feuillues,,,13630,-0.108728,46.551899
2021-1362051,2021-10-21,000001,Vente,265000,,,BOIS DE LA GARDE,B009,79420,79340,Vausseroux,79,,,793400000C0238,,,,,,,,,,,,,0,,,,,BT,taillis simples,,,176050,-0.106096,46.549182
2021-1362051,2021-10-21,000001,Vente,265000,,,BOIS DE LA GARDE,B009,79420,79340,Vausseroux,79,,,793400000C0238,,,,,,,,,,,,,0,,,,,BF,futaies feuillues,,,43900,-0.106096,46.549182
2021-1362051,2021-10-21,000001,Vente,265000,,,BOIS DE LA GARDE,B009,79420,79340,Vausseroux,79,,,793400000C0238,,,,,,,,,,,,,0,,,,,BT,taillis simples,,,109975,-0.106096,46.549182
2021-1362789,2021-10-25,000001,Vente,60000,5193,,LONGRUERE,B065,79420,79340,Vausseroux,79,,,793400000B0201,,,,,,,,,,,,,0,3,Dépendance,,0,S,sols,,,500,-0.13014,46.567327
2021-1362789,2021-10-25,000001,Vente,60000,5193,,LONGRUERE,B065,79420,79340,Vausseroux,79,,,793400000B0201,,,,,,,,,,,,,0,3,Dépendance,,0,J,jardins,,,1134,-0.13014,46.567327
2021-1362789,2021-10-25,000001,Vente,60000,5063,A,LONGRUERE OUEST,B036,79420,79340,Vausseroux,79,,,793400000B0226,,,,,,,,,,,,,0,1,Maison,74,4,S,sols,,,1855,-0.129832,46.567401
2021-1362789,2021-10-25,000001,Vente,60000,5063,A,LONGRUERE OUEST,B036,79420,79340,Vausseroux,79,,,793400000B0226,,,,,,,,,,,,,0,1,Maison,74,4,J,jardins,,,1800,-0.129832,46.567401
2021-1364580,2021-12-17,000001,Vente,6000,,,LE BOURG,B015,79420,79340,Vausseroux,79,,,79340000AA0016,,,,,,,,,,,,,0,,,,,P,prés,,,1042,-0.138182,46.549613
2021-1364580,2021-12-17,000001,Vente,6000,,,LE BOURG,B015,79420,79340,Vausseroux,79,,,79340000AA0017,,,,,,,,,,,,,0,,,,,S,sols,,,537,-0.138086,46.549772
2021-1364580,2021-12-17,000001,Vente,6000,13,,RTE DE VAUTEBIS,0062,79420,79340,Vausseroux,79,,,79340000AA0018,,,,,,,,,,,,,0,4,Local industriel. commercial ou assimilé,506,0,S,sols,,,487,-0.138076,46.549893
2021-1364580,2021-12-17,000001,Vente,6000,13,,RTE DE VAUTEBIS,0062,79420,79340,Vausseroux,79,,,79340000AA0018,,,,,,,,,,,,,0,4,Local industriel. commercial ou assimilé,65,0,S,sols,,,487,-0.138076,46.549893
2021-1364580,2021-12-17,000001,Vente,6000,,,LE BOURG,B015,79420,79340,Vausseroux,79,,,79340000AA0019,,,,,,,,,,,,,0,,,,,S,sols,,,15,-0.137902,46.549812
2021-1364580,2021-12-17,000001,Vente,6000,,,LE BOURG,B015,79420,79340,Vausseroux,79,,,79340000AA0138,,,,,,,,,,,,,0,,,,,S,sols,,,13,-0.137723,46.549604
2021-1364580,2021-12-17,000001,Vente,6000,,,LE BOURG,B015,79420,79340,Vausseroux,79,,,79340000AA0141,,,,,,,,,,,,,0,,,,,S,sols,,,14,-0.137896,46.54979
2021-1364580,2021-12-17,000001,Vente,6000,,,LE BOURG,B015,79420,79340,Vausseroux,79,,,79340000AA0145,,,,,,,,,,,,,0,,,,,P,prés,,,437,-0.1387,46.549957
