id_mutation,date_mutation,numero_disposition,nature_mutation,valeur_fonciere,adresse_numero,adresse_suffixe,adresse_nom_voie,adresse_code_voie,code_postal,code_commune,nom_commune,code_departement,ancien_code_commune,ancien_nom_commune,id_parcelle,ancien_id_parcelle,numero_volume,lot1_numero,lot1_surface_carrez,lot2_numero,lot2_surface_carrez,lot3_numero,lot3_surface_carrez,lot4_numero,lot4_surface_carrez,lot5_numero,lot5_surface_carrez,nombre_lots,code_type_local,type_local,surface_reelle_bati,nombre_pieces_principales,code_nature_culture,nature_culture,code_nature_culture_speciale,nature_culture_speciale,surface_terrain,longitude,latitude
2021-1353460,2021-01-28,000001,Vente,20000,,,LE BOURG,B002,79170,79346,Le Vert,79,,,793460000C0234,,,,,,,,,,,,,0,,,,,S,sols,,,1412,-0.393652,46.093624
2021-1353460,2021-01-28,000001,Vente,20000,,,LE BOURG,B002,79170,79346,Le Vert,79,,,793460000C1229,,,,,,,,,,,,,0,,,,,S,sols,,,271,-0.393633,46.093286
2021-1356077,2021-04-22,000001,Vente,90000,5103,,VILLE DES EAUX,B053,79170,79346,Le Vert,79,,,793460000C1198,,,,,,,,,,,,,0,1,Maison,185,3,S,sols,,,956,-0.373351,46.095076
2021-1356473,2021-04-29,000001,Vente,1500,,,LE FIEF TROGNAT,B021,79170,79346,Le Vert,79,,,793460000A0321,,,,,,,,,,,,,0,,,,,BT,taillis simples,,,4705,-0.408229,46.098832
2021-1356473,2021-04-29,000001,Vente,1500,,,PIECES DE LA MACONNE,B035,79170,79346,Le Vert,79,,,793460000B0025,,,,,,,,,,,,,0,,,,,BT,taillis simples,,,10200,-0.398955,46.107183
2021-1356473,2021-04-29,000001,Vente,1500,,,LA VERGNEE,B050,79170,79346,Le Vert,79,,,793460000C0967,,,,,,,,,,,,,0,,,,,P,prés,,,256,-0.39018,46.096278
2021-1356473,2021-04-29,000001,Vente,1500,,,LA COUTURE,B016,79170,79346,Le Vert,79,,,79346000ZE0144,,,,,,,,,,,,,0,,,,,BT,taillis simples,,,1970,-0.405388,46.086673
2021-1356473,2021-04-29,000001,Vente,1500,,,LE FIEF DU VERT,B019,79170,79346,Le Vert,79,,,79346000ZE0179,,,,,,,,,,,,,0,,,,,BT,taillis simples,,,910,-0.410788,46.097455
2021-1358313,2021-06-30,000001,Vente,300,,,LE BOURG,B002,79170,79346,Le Vert,79,,,793460000C1311,,,,,,,,,,,,,0,,,,,S,sols,,,35,-0.395992,46.092502
2021-1358531,2021-06-22,000001,Vente,1500,,,CHAMPS DE L ABBAYE,B008,79170,79346,Le Vert,79,,,79346000ZD0022,,,,,,,,,,,,,0,,,,,T,terres,,,2470,-0.392756,46.096966
2021-1358531,2021-06-22,000001,Vente,1500,,,CHAMPS DE L ABBAYE,B008,79170,79346,Le Vert,79,,,79346000ZD0022,,,,,,,,,,,,,0,,,,,T,terres,,,2470,-0.392756,46.096966
2021-1359106,2021-07-26,000001,Vente,180000,,,VILLE DES EAUX,B053,79170,79346,Le Vert,79,,,793460000C0890,,,,,,,,,,,,,0,,,,,S,sols,,,1470,-0.374458,46.095205
2021-1359106,2021-07-26,000001,Vente,180000,5,,RUE DE LA BOUTONNE,0004,79170,79346,Le Vert,79,,,793460000C0892,,,,,,,,,,,,,0,3,Dépendance,,0,S,sols,,,1440,-0.374428,46.095009
2021-1359106,2021-07-26,000001,Vente,180000,5,,RUE DE LA BOUTONNE,0004,79170,79346,Le Vert,79,,,793460000C0892,,,,,,,,,,,,,0,3,Dépendance,,0,S,sols,,,1440,-0.374428,46.095009
2021-1359106,2021-07-26,000001,Vente,180000,5,,RUE DE LA BOUTONNE,0004,79170,79346,Le Vert,79,,,793460000C0892,,,,,,,,,,,,,0,1,Maison,246,7,S,sols,,,1440,-0.374428,46.095009
2021-1359106,2021-07-26,000001,Vente,180000,5,,RUE DE LA BOUTONNE,0004,79170,79346,Le Vert,79,,,793460000C0892,,,,,,,,,,,,,0,3,Dépendance,,0,S,sols,,,1440,-0.374428,46.095009
2021-1359106,2021-07-26,000001,Vente,180000,,,VILLE DES EAUX,B053,79170,79346,Le Vert,79,,,793460000C0895,,,,,,,,,,,,,0,,,,,AG,terrains d'agrément,,,630,-0.374064,46.095076
2021-1359106,2021-07-26,000001,Vente,180000,,,VILLE DES EAUX,B053,79170,79346,Le Vert,79,,,793460000C0903,,,,,,,,,,,,,0,,,,,P,prés,,,1710,-0.373879,46.09448
2021-1359106,2021-07-26,000001,Vente,180000,,,VILLE DES EAUX,B053,79170,79346,Le Vert,79,,,793460000C1142,,,,,,,,,,,,,0,,,,,S,sols,,,52,-0.373642,46.095246
2021-1359106,2021-07-26,000001,Vente,180000,,,VILLE DES EAUX,B053,79170,79346,Le Vert,79,,,793460000C1305,,,,,,,,,,,,,0,,,,,AG,terrains d'agrément,,,8,-0.37401,46.095302
2021-1359106,2021-07-26,000001,Vente,180000,,,VILLE DES EAUX,B053,79170,79346,Le Vert,79,,,793460000C1307,,,,,,,,,,,,,0,,,,,AG,terrains d'agrément,,,1049,-0.373849,46.095261
2021-1359106,2021-07-26,000001,Vente,180000,,,LE CLOS D ANGLES,B013,79170,79346,Le Vert,79,,,79346000ZC0050,,,,,,,,,,,,,0,,,,,AG,terrains d'agrément,,,1630,-0.374946,46.09538
2021-1359988,2021-08-12,000001,Vente,500,,,LA MACONNE,B028,79170,79346,Le Vert,79,,,793460000B0461,,,,,,,,,,,,,0,,,,,S,sols,,,153,-0.399101,46.104876
2021-1360612,2021-08-27,000001,Vente,1000,,,LA CHAUME BEAUVAIS,B009,79170,79346,Le Vert,79,,,793460000A0275,,,,,,,,,,,,,0,,,,,BT,taillis simples,,,4175,-0.405037,46.101487
2021-1362224,2021-10-11,000001,Vente,120000,12,,RUE DE LA BOUTONNE,0004,79170,79346,Le Vert,79,,,793460000C1259,,,,,,,,,,,,,0,1,Maison,60,2,S,sols,,,547,-0.37324,46.095167
2021-1363648,2021-12-02,000001,Vente,165000,3,,RTE DES OUILLERES,0040,79170,79346,Le Vert,79,,,793460000B0015,,,,,,,,,,,,,0,3,Dépendance,,0,S,sols,,,840,-0.399012,46.104732
2021-1363648,2021-12-02,000001,Vente,165000,3,,RTE DES OUILLERES,0040,79170,79346,Le Vert,79,,,793460000B0015,,,,,,,,,,,,,0,1,Maison,200,7,S,sols,,,840,-0.399012,46.104732
2021-1363648,2021-12-02,000001,Vente,165000,,,LA MACONNE,B028,79170,79346,Le Vert,79,,,793460000B0016,,,,,,,,,,,,,0,,,,,S,sols,,,530,-0.399188,46.104671
2021-1363648,2021-12-02,000001,Vente,165000,,,LA MACONNE,B028,79170,79346,Le Vert,79,,,793460000B0017,,,,,,,,,,,,,0,,,,,S,sols,,,1020,-0.399321,46.104677
2021-1363648,2021-12-02,000001,Vente,165000,,,LA MACONNE,B028,79170,79346,Le Vert,79,,,793460000B0461,,,,,,,,,,,,,0,,,,,S,sols,,,153,-0.399101,46.104876
2021-1363648,2021-12-02,000001,Vente,165000,,,LE CLOUZEAU,B014,79170,79346,Le Vert,79,,,79346000ZD0040,,,,,,,,,,,,,0,,,,,T,terres,,,3380,-0.399034,46.104053
2021-1363648,2021-12-02,000001,Vente,165000,,,LE CLOUZEAU,B014,79170,79346,Le Vert,79,,,79346000ZD0041,,,,,,,,,,,,,0,,,,,S,sols,,,100,-0.399281,46.10429
2021-1363648,2021-12-02,000001,Vente,165000,,,LE CLOUZEAU,B014,79170,79346,Le Vert,79,,,79346000ZD0041,,,,,,,,,,,,,0,,,,,T,terres,,,3450,-0.399281,46.10429
2021-1363648,2021-12-02,000001,Vente,165000,,,LE CLOUZEAU,B014,79170,79346,Le Vert,79,,,79346000ZD0042,,,,,,,,,,,,,0,,,,,T,terres,,,9870,-0.400068,46.1046
2021-1363648,2021-12-02,000001,Vente,165000,,,LE CLOUZEAU,B014,79170,79346,Le Vert,79,,,79346000ZD0059,,,,,,,,,,,,,0,,,,,T,terres,,,1680,-0.399648,46.104032
2021-1364164,2021-12-17,000001,Vente,428,,,LA RIVIERE DU VERT,B043,79170,79346,Le Vert,79,,,793460000C0547,,,,,,,,,,,,,0,,,,,P,prés,,,2140,-0.400667,46.085133
2021-1365015,2021-12-28,000001,Vente,45000,,,CARVILLE,B004,79170,79346,Le Vert,79,,,793460000B0076,,,,,,,,,,,,,0,,,,,T,terres,,,5955,-0.388133,46.113446
2021-1365015,2021-12-28,000001,Vente,45000,3,,RTE DE LA FORET,0020,79170,79346,Le Vert,79,,,793460000B0077,,,,,,,,,,,,,0,1,Maison,100,3,S,sols,,,1425,-0.388079,46.11348
2021-1365015,2021-12-28,000001,Vente,45000,,,CARVILLE,B004,79170,79346,Le Vert,79,,,793460000B0083,,,,,,,,,,,,,0,,,,,T,terres,,,310,-0.388023,46.113938
2021-1365015,2021-12-28,000001,Vente,45000,,,CARVILLE,B004,79170,79346,Le Vert,79,,,793460000B0084,,,,,,,,,,,,,0,,,,,T,terres,,,30,-0.387936,46.113781
