id_mutation,date_mutation,numero_disposition,nature_mutation,valeur_fonciere,adresse_numero,adresse_suffixe,adresse_nom_voie,adresse_code_voie,code_postal,code_commune,nom_commune,code_departement,ancien_code_commune,ancien_nom_commune,id_parcelle,ancien_id_parcelle,numero_volume,lot1_numero,lot1_surface_carrez,lot2_numero,lot2_surface_carrez,lot3_numero,lot3_surface_carrez,lot4_numero,lot4_surface_carrez,lot5_numero,lot5_surface_carrez,nombre_lots,code_type_local,type_local,surface_reelle_bati,nombre_pieces_principales,code_nature_culture,nature_culture,code_nature_culture_speciale,nature_culture_speciale,surface_terrain,longitude,latitude
2021-1377597,2021-03-19,000001,Vente,125000,11,,RUE LAMARCK,0050,80300,80059,Bazentin,80,,,800590000A0134,,,,,,,,,,,,,0,1,Maison,107,5,S,sols,,,533,2.762482,50.032291
2021-1377597,2021-03-19,000001,Vente,125000,11,,RUE LAMARCK,0050,80300,80059,Bazentin,80,,,800590000A0134,,,,,,,,,,,,,0,1,Maison,107,5,J,jardins,,,2350,2.762482,50.032291
2021-1377629,2021-03-01,000001,Vente,222519,,,LE VILLAGE,B026,80300,80059,Bazentin,80,,,800590000A0222,,,,,,,,,,,,,0,,,,,S,sols,,,11,2.761492,50.032406
2021-1377629,2021-03-01,000001,Vente,222519,10,,RUE LAMARCK,0050,80300,80059,Bazentin,80,,,800590000A0223,,,,,,,,,,,,,0,1,Maison,163,3,S,sols,,,703,2.761344,50.03244
2021-1377629,2021-03-01,000001,Vente,222519,12,,RUE LAMARCK,0050,80300,80059,Bazentin,80,,,800590000A0377,,,,,,,,,,,,,0,,,,,S,sols,,,93,2.761133,50.032388
2021-1377842,2021-04-23,000001,Vente,21358.4,,,BUISSON SAINT MAUR,B008,80300,80059,Bazentin,80,,,800590000A0069,,,,,,,,,,,,,0,,,,,T,terres,,,2192,2.761495,50.039866
2021-1377842,2021-04-23,000001,Vente,21358.4,,,BUISSON DES TROIS EVECHES,B007,80300,80059,Bazentin,80,,,80059000ZB0006,,,,,,,,,,,,,0,,,,,T,terres,,,1200,2.77577,50.042558
2021-1378001,2021-06-11,000001,Vente,60000,1,,RUE NEUVE,0060,80300,80059,Bazentin,80,,,800590000A0143,,,,,,,,,,,,,0,3,Dépendance,,0,S,sols,,,813,2.762762,50.0311
2021-1378001,2021-06-11,000001,Vente,60000,1,,RUE NEUVE,0060,80300,80059,Bazentin,80,,,800590000A0143,,,,,,,,,,,,,0,3,Dépendance,,0,S,sols,,,813,2.762762,50.0311
2021-1378001,2021-06-11,000001,Vente,60000,1,,RUE NEUVE,0060,80300,80059,Bazentin,80,,,800590000A0143,,,,,,,,,,,,,0,1,Maison,100,4,S,sols,,,813,2.762762,50.0311
2021-1378001,2021-06-11,000001,Vente,60000,1,,RUE NEUVE,0060,80300,80059,Bazentin,80,,,800590000A0143,,,,,,,,,,,,,0,3,Dépendance,,0,S,sols,,,813,2.762762,50.0311
2021-1378001,2021-06-11,000001,Vente,60000,1,,RUE NEUVE,0060,80300,80059,Bazentin,80,,,800590000A0143,,,,,,,,,,,,,0,3,Dépendance,,0,S,sols,,,813,2.762762,50.0311
2021-1378001,2021-06-11,000001,Vente,60000,,,LE VILLAGE,B026,80300,80059,Bazentin,80,,,800590000A0199,,,,,,,,,,,,,0,,,,,P,prés,,,46,2.762788,50.030759
2021-1378438,2021-06-09,000001,Vente,25000,17,,RUE LAMARCK,0050,80300,80059,Bazentin,80,,,800590000A0197,,,,,,,,,,,,,0,3,Dépendance,,0,S,sols,,,649,2.763427,50.030637
2021-1378438,2021-06-09,000001,Vente,25000,17,,RUE LAMARCK,0050,80300,80059,Bazentin,80,,,800590000A0197,,,,,,,,,,,,,0,1,Maison,58,3,S,sols,,,649,2.763427,50.030637
