id_mutation,date_mutation,numero_disposition,nature_mutation,valeur_fonciere,adresse_numero,adresse_suffixe,adresse_nom_voie,adresse_code_voie,code_postal,code_commune,nom_commune,code_departement,ancien_code_commune,ancien_nom_commune,id_parcelle,ancien_id_parcelle,numero_volume,lot1_numero,lot1_surface_carrez,lot2_numero,lot2_surface_carrez,lot3_numero,lot3_surface_carrez,lot4_numero,lot4_surface_carrez,lot5_numero,lot5_surface_carrez,nombre_lots,code_type_local,type_local,surface_reelle_bati,nombre_pieces_principales,code_nature_culture,nature_culture,code_nature_culture_speciale,nature_culture_speciale,surface_terrain,longitude,latitude
2021-1370672,2021-11-19,000001,Vente,127000,,,PRES DU MOULIN,B025,80370,80060,Béalcourt,80,,,80060000ZA0031,,,,,,,,,,,,,0,,,,,P,prés,,,7464,2.187186,50.204824
2021-1370672,2021-11-19,000001,Vente,127000,,,PRES DU MOULIN,B025,80370,80060,Béalcourt,80,,,80060000ZA0031,,,,,,,,,,,,,0,,,,,S,sols,,,336,2.187186,50.204824
2021-1370672,2021-11-19,000001,Vente,127000,7,,RUE DES VANNIERS,0160,80370,80060,Béalcourt,80,,,80060000ZA0038,,,,,,,,,,,,,0,1,Maison,103,5,S,sols,,,908,2.187304,50.205032
2021-1370672,2021-11-19,000001,Vente,127000,7,,RUE DES VANNIERS,0160,80370,80060,Béalcourt,80,,,80060000ZA0038,,,,,,,,,,,,,0,3,Dépendance,,0,S,sols,,,908,2.187304,50.205032
2021-1370672,2021-11-19,000001,Vente,127000,,,PRES DU MOULIN,B025,80370,80060,Béalcourt,80,,,80060000ZA0063,,,,,,,,,,,,,0,,,,,P,prés,,,2232,2.186672,50.205034
2021-1373010,2021-02-26,000001,Vente,64950,,,PRES DE MONCHAUX,B024,80370,80060,Béalcourt,80,,,80060000ZA0035,,,,,,,,,,,,,0,,,,,P,prés,,,10650,2.185453,50.207748
2021-1373010,2021-02-26,000001,Vente,64950,,,LA FOSSE MINY,B015,80370,80060,Béalcourt,80,,,80060000ZB0034,,,,,,,,,,,,,0,,,,,T,terres,,,17015,2.190181,50.196341
2021-1373010,2021-02-26,000001,Vente,64950,,,LA FOSSE MINY,B015,80370,80060,Béalcourt,80,,,80060000ZB0034,,,,,,,,,,,,,0,,,,,T,terres,,,8508,2.190181,50.196341
2021-1373010,2021-02-26,000001,Vente,64950,,,LA FOSSE MINY,B015,80370,80060,Béalcourt,80,,,80060000ZB0034,,,,,,,,,,,,,0,,,,,T,terres,,,8507,2.190181,50.196341
2021-1373010,2021-02-26,000001,Vente,64950,,,LE PRESBYTERE,B028,80370,80060,Béalcourt,80,,,80060000ZB0046,,,,,,,,,,,,,0,,,,,P,prés,,,24760,2.181677,50.198712
2021-1373010,2021-02-26,000001,Vente,64950,,,LA TERRE AUX CHENES,B035,80370,80060,Béalcourt,80,,,80060000ZC0016,,,,,,,,,,,,,0,,,,,T,terres,,,20320,2.187555,50.192707
2021-1373010,2021-02-26,000001,Vente,64950,,,LA TERRE AUX CHENES,B035,80370,80060,Béalcourt,80,,,80060000ZC0016,,,,,,,,,,,,,0,,,,,T,terres,,,10160,2.187555,50.192707
2021-1374380,2021-06-07,000001,Vente,47500,1,,RUE DU HAUT,0060,80370,80060,Béalcourt,80,,,80060000AC0109,,,,,,,,,,,,,0,1,Maison,53,3,S,sols,,,437,2.185043,50.204374
2021-1374380,2021-06-07,000001,Vente,47500,1,,RUE DU HAUT,0060,80370,80060,Béalcourt,80,,,80060000AC0109,,,,,,,,,,,,,0,3,Dépendance,,0,S,sols,,,437,2.185043,50.204374
2021-1374380,2021-06-07,000001,Vente,47500,,,RUE DU HAUT,0060,80370,80060,Béalcourt,80,,,80060000AC0110,,,,,,,,,,,,,0,,,,,J,jardins,,,748,2.185508,50.204187
2021-1374492,2021-06-22,000001,Vente,130000,3,,RUE DE BEAUVOIR,0020,80370,80060,Béalcourt,80,,,80060000AB0098,,,,,,,,,,,,,0,3,Dépendance,,0,J,jardins,,,689,2.178743,50.207314
2021-1374492,2021-06-22,000001,Vente,130000,3,,RUE DE BEAUVOIR,0020,80370,80060,Béalcourt,80,,,80060000AB0098,,,,,,,,,,,,,0,3,Dépendance,,0,S,sols,,,511,2.178743,50.207314
2021-1374492,2021-06-22,000001,Vente,130000,3,,RUE DE BEAUVOIR,0020,80370,80060,Béalcourt,80,,,80060000AB0098,,,,,,,,,,,,,0,3,Dépendance,,0,S,sols,,,511,2.178743,50.207314
2021-1374492,2021-06-22,000001,Vente,130000,3,,RUE DE BEAUVOIR,0020,80370,80060,Béalcourt,80,,,80060000AB0098,,,,,,,,,,,,,0,3,Dépendance,,0,S,sols,,,511,2.178743,50.207314
2021-1374492,2021-06-22,000001,Vente,130000,3,,RUE DE BEAUVOIR,0020,80370,80060,Béalcourt,80,,,80060000AB0098,,,,,,,,,,,,,0,1,Maison,119,4,S,sols,,,511,2.178743,50.207314
2021-1374492,2021-06-22,000001,Vente,130000,3,,RUE DE BEAUVOIR,0020,80370,80060,Béalcourt,80,,,80060000AB0098,,,,,,,,,,,,,0,3,Dépendance,,0,J,jardins,,,689,2.178743,50.207314
2021-1374492,2021-06-22,000001,Vente,130000,3,,RUE DE BEAUVOIR,0020,80370,80060,Béalcourt,80,,,80060000AB0098,,,,,,,,,,,,,0,3,Dépendance,,0,J,jardins,,,689,2.178743,50.207314
2021-1374492,2021-06-22,000001,Vente,130000,3,,RUE DE BEAUVOIR,0020,80370,80060,Béalcourt,80,,,80060000AB0098,,,,,,,,,,,,,0,1,Maison,119,4,J,jardins,,,689,2.178743,50.207314
2021-1374522,2021-07-16,000001,Vente,115000,,,PRES DE MONCHAUX,B024,80370,80060,Béalcourt,80,,,80060000ZA0034,,,,,,,,,,,,,0,,,,,P,prés,,,245,2.189329,50.205338
2021-1374522,2021-07-16,000001,Vente,115000,1,,RUE DU MOULIN,0100,80370,80060,Béalcourt,80,,,80060000ZA0042,,,,,,,,,,,,,0,3,Dépendance,,0,S,sols,,,321,2.189444,50.205376
2021-1374522,2021-07-16,000001,Vente,115000,1,,RUE DU MOULIN,0100,80370,80060,Béalcourt,80,,,80060000ZA0042,,,,,,,,,,,,,0,3,Dépendance,,0,S,sols,,,321,2.189444,50.205376
2021-1374522,2021-07-16,000001,Vente,115000,1,,RUE DU MOULIN,0100,80370,80060,Béalcourt,80,,,80060000ZA0042,,,,,,,,,,,,,0,3,Dépendance,,0,S,sols,,,321,2.189444,50.205376
2021-1374522,2021-07-16,000001,Vente,115000,1,,RUE DU MOULIN,0100,80370,80060,Béalcourt,80,,,80060000ZA0042,,,,,,,,,,,,,0,1,Maison,152,6,S,sols,,,321,2.189444,50.205376
2021-1374522,2021-07-16,000001,Vente,115000,,,PRES DU MOULIN,B025,80370,80060,Béalcourt,80,,,80060000ZA0043,,,,,,,,,,,,,0,,,,,J,jardins,,,859,2.189449,50.20553
