id_mutation,date_mutation,numero_disposition,nature_mutation,valeur_fonciere,adresse_numero,adresse_suffixe,adresse_nom_voie,adresse_code_voie,code_postal,code_commune,nom_commune,code_departement,ancien_code_commune,ancien_nom_commune,id_parcelle,ancien_id_parcelle,numero_volume,lot1_numero,lot1_surface_carrez,lot2_numero,lot2_surface_carrez,lot3_numero,lot3_surface_carrez,lot4_numero,lot4_surface_carrez,lot5_numero,lot5_surface_carrez,nombre_lots,code_type_local,type_local,surface_reelle_bati,nombre_pieces_principales,code_nature_culture,nature_culture,code_nature_culture_speciale,nature_culture_speciale,surface_terrain,longitude,latitude
2021-1370516,2021-11-09,000001,Vente,160000,1,,RUE DU GRAND REUMET,0075,80690,80145,Brucamps,80,,,801450000B0177,,,,,,,,,,,,,0,1,Maison,130,6,S,sols,,,410,2.058717,50.073187
2021-1370516,2021-11-09,000001,Vente,160000,,,LE VILLAGE,B025,80690,80145,Brucamps,80,,,801450000B0370,,,,,,,,,,,,,0,,,,,S,sols,,,63,2.058784,50.073183
2021-1370516,2021-11-09,000001,Vente,160000,,,LE VILLAGE,B025,80690,80145,Brucamps,80,,,801450000B0410,,,,,,,,,,,,,0,,,,,P,prés,,,48,2.058762,50.073431
2021-1370516,2021-11-09,000001,Vente,160000,,,LE VILLAGE,B025,80690,80145,Brucamps,80,,,801450000B0413,,,,,,,,,,,,,0,,,,,P,prés,,,404,2.058714,50.073345
2021-1372615,2021-02-04,000001,Vente,23000,,,AU PONT DE VAUCHELLES,B020,80690,80145,Brucamps,80,,,801450000C0160,,,,,,,,,,,,,0,,,,,BT,taillis simples,,,35295,2.053719,50.065271
2021-1373114,2021-03-08,000001,Vente,110000,18,,GR GRANDE RUE,X010,80690,80145,Brucamps,80,,,801450000B0211,,,,,,,,,,,,,0,1,Maison,120,4,S,sols,,,340,2.057379,50.073097
2021-1373114,2021-03-08,000001,Vente,110000,,,GR GRANDE RUE,X010,80690,80145,Brucamps,80,,,801450000B0213,,,,,,,,,,,,,0,,,,,J,jardins,,,830,2.057092,50.073026
2021-1373557,2021-04-29,000001,Vente,54000,,,AU LIEVRE MORT,B014,80690,80145,Brucamps,80,,,80145000ZD0005,,,,,,,,,,,,,0,,,,,BT,taillis simples,,,640,2.054893,50.079019
2021-1373557,2021-04-29,000001,Vente,54000,,,AU LIEVRE MORT,B014,80690,80145,Brucamps,80,,,80145000ZD0005,,,,,,,,,,,,,0,,,,,P,prés,,,13740,2.054893,50.079019
2021-1373557,2021-04-29,000001,Vente,54000,,,AU LIEVRE MORT,B014,80690,80145,Brucamps,80,,,80145000ZD0005,,,,,,,,,,,,,0,,,,,P,prés,,,13740,2.054893,50.079019
2021-1373557,2021-04-29,000001,Vente,54000,,,AU MOULIN,B019,80690,80145,Brucamps,80,,,80145000ZD0026,,,,,,,,,,,,,0,,,,,P,prés,,,19080,2.064102,50.07659
2021-1373557,2021-04-29,000001,Vente,54000,,,AU MOULIN,B019,80690,80145,Brucamps,80,,,80145000ZD0026,,,,,,,,,,,,,0,,,,,L,landes,FRICH,Friche,370,2.064102,50.07659
2021-1373557,2021-04-29,000001,Vente,54000,,,AU MOULIN,B019,80690,80145,Brucamps,80,,,80145000ZD0026,,,,,,,,,,,,,0,,,,,T,terres,,,11500,2.064102,50.07659
2021-1373677,2021-05-03,000001,Vente,150000,,,LARRIS DU BOIS DU PARC,B013,80690,80145,Brucamps,80,,,801450000C0077,,,,,,,,,,,,,0,,,,,T,terres,,,2130,2.056714,50.069212
2021-1373677,2021-05-03,000001,Vente,150000,13,,RUE DE VAUCHELLES,0080,80690,80145,Brucamps,80,,,801450000C0089,,,,,,,,,,,,,0,1,Maison,94,5,BT,taillis simples,,,2323,2.057127,50.068901
2021-1373677,2021-05-03,000001,Vente,150000,13,,RUE DE VAUCHELLES,0080,80690,80145,Brucamps,80,,,801450000C0089,,,,,,,,,,,,,0,1,Maison,94,5,S,sols,,,567,2.057127,50.068901
2021-1374348,2021-06-15,000001,Vente,184000,10,,GR GRANDE RUE,X010,80690,80145,Brucamps,80,,,801450000B0150,,,,,,,,,,,,,0,1,Maison,244,5,S,sols,,,530,2.057042,50.073842
2021-1374348,2021-06-15,000001,Vente,184000,,,LE VILLAGE,B025,80690,80145,Brucamps,80,,,801450000B0151,,,,,,,,,,,,,0,,,,,J,jardins,,,651,2.057305,50.073804
