id_mutation,date_mutation,numero_disposition,nature_mutation,valeur_fonciere,adresse_numero,adresse_suffixe,adresse_nom_voie,adresse_code_voie,code_postal,code_commune,nom_commune,code_departement,ancien_code_commune,ancien_nom_commune,id_parcelle,ancien_id_parcelle,numero_volume,lot1_numero,lot1_surface_carrez,lot2_numero,lot2_surface_carrez,lot3_numero,lot3_surface_carrez,lot4_numero,lot4_surface_carrez,lot5_numero,lot5_surface_carrez,nombre_lots,code_type_local,type_local,surface_reelle_bati,nombre_pieces_principales,code_nature_culture,nature_culture,code_nature_culture_speciale,nature_culture_speciale,surface_terrain,longitude,latitude
2021-1370698,2021-12-07,000001,Vente,2100,,,LE VILLAGE,B033,80240,80258,Driencourt,80,,,802580000C0052,,,,,,,,,,,,,0,,,,,L,landes,,,683,3.009153,49.957088
2021-1371921,2021-12-16,000001,Vente,1800,,,VALLEE DU BOIS DE BUIRE,B028,80240,80258,Driencourt,80,,,802580000B0119,,,,,,,,,,,,,0,,,,,S,sols,,,2860,3.01984,49.956929
2021-1378100,2021-06-17,000001,Vente,162000,,,VALLEE DE L EGLISE,B027,80240,80258,Driencourt,80,,,802580000B0192,,,,,,,,,,,,,0,,,,,BS,taillis sous futaie,,,40,3.010576,49.957342
2021-1378100,2021-06-17,000001,Vente,162000,,,LE VILLAGE,B033,80240,80258,Driencourt,80,,,802580000C0041,,,,,,,,,,,,,0,,,,,J,jardins,,,527,3.009986,49.9575
2021-1378100,2021-06-17,000001,Vente,162000,1,,RUE BASTIFOUR,0060,80240,80258,Driencourt,80,,,802580000C0042,,,,,,,,,,,,,0,3,Dépendance,,0,S,sols,,,388,3.010008,49.957354
2021-1378100,2021-06-17,000001,Vente,162000,1,,RUE BASTIFOUR,0060,80240,80258,Driencourt,80,,,802580000C0042,,,,,,,,,,,,,0,3,Dépendance,,0,S,sols,,,388,3.010008,49.957354
2021-1378100,2021-06-17,000001,Vente,162000,1,,RUE BASTIFOUR,0060,80240,80258,Driencourt,80,,,802580000C0042,,,,,,,,,,,,,0,1,Maison,153,6,S,sols,,,388,3.010008,49.957354
2021-1378100,2021-06-17,000001,Vente,162000,,,LE VILLAGE,B033,80240,80258,Driencourt,80,,,802580000C0151,,,,,,,,,,,,,0,,,,,J,jardins,,,474,3.011205,49.9577
2021-1378100,2021-06-17,000001,Vente,162000,1,B,RUE BASTIFOUR,0060,80240,80258,Driencourt,80,,,802580000C0188,,,,,,,,,,,,,0,,,,,S,sols,,,354,3.01006,49.957181
2021-1378100,2021-06-17,000001,Vente,162000,,,LE VILLAGE,B033,80240,80258,Driencourt,80,,,802580000C0189,,,,,,,,,,,,,0,,,,,BS,taillis sous futaie,,,1339,3.010271,49.957428
2021-1378100,2021-06-17,000001,Vente,162000,,,LE VILLAGE,B033,80240,80258,Driencourt,80,,,802580000C0190,,,,,,,,,,,,,0,,,,,BS,taillis sous futaie,,,895,3.010743,49.957616
2021-1378296,2021-07-16,000001,Vente,165000,9,,RUE D AIZECOURT LE HAUT,0020,80240,80258,Driencourt,80,,,802580000C0084,,,,,,,,,,,,,0,3,Dépendance,,0,S,sols,,,95,3.009253,49.959148
2021-1378296,2021-07-16,000001,Vente,165000,9,,RUE D AIZECOURT LE HAUT,0020,80240,80258,Driencourt,80,,,802580000C0084,,,,,,,,,,,,,0,1,Maison,152,6,S,sols,,,95,3.009253,49.959148
2021-1378296,2021-07-16,000001,Vente,165000,,,LE VILLAGE,B033,80240,80258,Driencourt,80,,,802580000C0122,,,,,,,,,,,,,0,,,,,S,sols,,,513,3.009247,49.958801
2021-1378296,2021-07-16,000001,Vente,165000,,,LE VILLAGE,B033,80240,80258,Driencourt,80,,,802580000C0147,,,,,,,,,,,,,0,,,,,S,sols,,,705,3.009208,49.959089
2021-1378543,2021-09-06,000001,Vente,1382.71,,,VALLEE DE L EGLISE,B027,80240,80258,Driencourt,80,,,802580000B0031,,,,,,,,,,,,,0,,,,,T,terres,,,2900,3.016431,49.955743
2021-1378543,2021-09-06,000001,Vente,1382.71,,,LE ROUGE AVAL,B025,80240,80258,Driencourt,80,,,802580000B0041,,,,,,,,,,,,,0,,,,,T,terres,,,14950,3.015024,49.961465
2021-1378543,2021-09-06,000001,Vente,1382.71,,,LE ROUGE AVAL,B025,80240,80258,Driencourt,80,,,802580000B0041,,,,,,,,,,,,,0,,,,,T,terres,,,14950,3.015024,49.961465
