id_mutation,date_mutation,numero_disposition,nature_mutation,valeur_fonciere,adresse_numero,adresse_suffixe,adresse_nom_voie,adresse_code_voie,code_postal,code_commune,nom_commune,code_departement,ancien_code_commune,ancien_nom_commune,id_parcelle,ancien_id_parcelle,numero_volume,lot1_numero,lot1_surface_carrez,lot2_numero,lot2_surface_carrez,lot3_numero,lot3_surface_carrez,lot4_numero,lot4_surface_carrez,lot5_numero,lot5_surface_carrez,nombre_lots,code_type_local,type_local,surface_reelle_bati,nombre_pieces_principales,code_nature_culture,nature_culture,code_nature_culture_speciale,nature_culture_speciale,surface_terrain,longitude,latitude
2021-1365201,2021-01-06,000001,Vente,130000,10,,RUE ALBERT LAIGNEL,0008,80800,80412,Hamelet,80,,,80412000AC0010,,,,,,,,,,,,,0,1,Maison,81,4,S,sols,,,673,2.528509,49.903483
2021-1365383,2021-01-29,000001,Vente,219400,7,,RES EMILIE,A110,80800,80412,Hamelet,80,,,80412000AD0005,,,,,,,,,,,,,0,1,Maison,96,4,S,sols,,,637,2.533472,49.907303
2021-1365776,2021-02-01,000001,Vente,150500,13,,RUE SUZANNE POTET,0240,80800,80412,Hamelet,80,,,80412000AA0014,,,,,,,,,,,,,0,1,Maison,101,4,S,sols,,,296,2.526879,49.906578
2021-1366435,2021-03-17,000001,Vente,145000,8,,RUE ALBERT LAIGNEL,0008,80800,80412,Hamelet,80,,,80412000AC0009,,,,,,,,,,,,,0,1,Maison,91,4,S,sols,,,718,2.528411,49.903775
2021-1366720,2021-04-14,000001,Vente,20000,,,LA CHAUSSEE,B014,80800,80412,Hamelet,80,,,80412000ZB0019,,,,,,,,,,,,,0,,,,,T,terres,,,7486,2.544052,49.875009
2021-1367256,2021-06-07,000001,Vente,15000,,,LE PRE DELACOURT,B035,80800,80412,Hamelet,80,,,804120000Z0066,,,,,,,,,,,,,0,,,,,T,terres,,,3245,2.534588,49.912245
2021-1367256,2021-06-07,000001,Vente,15000,,,A LA CHAPELLE,B013,80800,80412,Hamelet,80,,,804120000Z0075,,,,,,,,,,,,,0,,,,,T,terres,,,6234,2.537569,49.908982
2021-1367294,2021-05-18,000001,Vente,264285,4,,RUE FRANCOIS DEROUSSEN,0118,80800,80412,Hamelet,80,,,80412000AC0038,,,,,,,,,,,,,0,1,Maison,106,6,S,sols,,,880,2.527164,49.903898
2021-1368571,2021-07-22,000001,Vente,178000,7,,RUE DE L ABBAYE,0004,80800,80412,Hamelet,80,,,80412000AC0032,,,,,,,,,,,,,0,1,Maison,101,6,S,sols,,,610,2.528171,49.902753
2021-1368571,2021-07-22,000001,Vente,178000,7,,RUE DE L ABBAYE,0004,80800,80412,Hamelet,80,,,80412000AC0032,,,,,,,,,,,,,0,3,Dépendance,,0,S,sols,,,610,2.528171,49.902753
2021-1368571,2021-07-22,000001,Vente,178000,7,,RUE DE L ABBAYE,0004,80800,80412,Hamelet,80,,,80412000AC0032,,,,,,,,,,,,,0,3,Dépendance,,0,S,sols,,,610,2.528171,49.902753
2021-1368959,2021-08-26,000002,Vente,160000,7,,RUE FRANCOIS DEROUSSEN,0118,80800,80412,Hamelet,80,,,80412000AA0071,,,,,,,,,,,,,0,1,Maison,80,5,,,,,,2.526518,49.904318
2021-1370970,2021-11-16,000001,Vente,214000,5,,RES THOMAS,A250,80800,80412,Hamelet,80,,,80412000AC0112,,,,,,,,,,,,,0,1,Maison,134,5,S,sols,,,850,2.53109,49.902958
2021-1370970,2021-11-16,000001,Vente,214000,5,,RES THOMAS,A250,80800,80412,Hamelet,80,,,80412000AC0112,,,,,,,,,,,,,0,3,Dépendance,,0,S,sols,,,850,2.53109,49.902958
2021-1370970,2021-11-16,000001,Vente,214000,5,,RES THOMAS,A250,80800,80412,Hamelet,80,,,80412000AC0112,,,,,,,,,,,,,0,3,Dépendance,,0,S,sols,,,850,2.53109,49.902958
2021-1371776,2021-12-10,000001,Vente,12000,,,LE VILLAGE,B046,80800,80412,Hamelet,80,,,80412000AA0004,,,,,,,,,,,,,0,,,,,P,prés,,,805,2.524822,49.905729
