id_mutation,date_mutation,numero_disposition,nature_mutation,valeur_fonciere,adresse_numero,adresse_suffixe,adresse_nom_voie,adresse_code_voie,code_postal,code_commune,nom_commune,code_departement,ancien_code_commune,ancien_nom_commune,id_parcelle,ancien_id_parcelle,numero_volume,lot1_numero,lot1_surface_carrez,lot2_numero,lot2_surface_carrez,lot3_numero,lot3_surface_carrez,lot4_numero,lot4_surface_carrez,lot5_numero,lot5_surface_carrez,nombre_lots,code_type_local,type_local,surface_reelle_bati,nombre_pieces_principales,code_nature_culture,nature_culture,code_nature_culture_speciale,nature_culture_speciale,surface_terrain,longitude,latitude
2021-1371208,2021-12-14,000002,Vente,212000,3,,CHE DES HAYOTTES,0052,80260,80431,Hérissart,80,,,80431000AA0188,,,,,,,,,,,,,0,3,Dépendance,,0,,,,,,2.412181,50.031716
2021-1371208,2021-12-14,000002,Vente,212000,3,,CHE DES HAYOTTES,0052,80260,80431,Hérissart,80,,,80431000AA0188,,,,,,,,,,,,,0,1,Maison,128,4,,,,,,2.412181,50.031716
2021-1371518,2021-12-16,000001,Vente,23732,,,LE BOIS D HERISSART,B007,80260,80431,Hérissart,80,,,80431000ZH0001,,,,,,,,,,,,,0,,,,,T,terres,,,27920,2.398367,50.035397
2021-1372067,2021-12-06,000001,Vente,80000,4,,RUE DE CONTAY,0030,80260,80431,Hérissart,80,,,80431000AD0025,,,,,,,,,,,,,0,1,Maison,94,6,S,sols,,,442,2.419623,50.024054
2021-1372067,2021-12-06,000001,Vente,80000,4,,RUE DE CONTAY,0030,80260,80431,Hérissart,80,,,80431000AD0025,,,,,,,,,,,,,0,3,Dépendance,,0,S,sols,,,442,2.419623,50.024054
2021-1372210,2021-12-20,000001,Vente,260000,19,,RES SAINT MARTIN,A001,80260,80431,Hérissart,80,,,80431000AB0027,,,,,,,,,,,,,0,1,Maison,115,4,J,jardins,,,715,2.412624,50.025387
2021-1372210,2021-12-20,000001,Vente,260000,19,,RES SAINT MARTIN,A001,80260,80431,Hérissart,80,,,80431000AB0027,,,,,,,,,,,,,0,3,Dépendance,,0,S,sols,,,500,2.412624,50.025387
2021-1372210,2021-12-20,000001,Vente,260000,19,,RES SAINT MARTIN,A001,80260,80431,Hérissart,80,,,80431000AB0027,,,,,,,,,,,,,0,1,Maison,115,4,S,sols,,,500,2.412624,50.025387
2021-1372210,2021-12-20,000001,Vente,260000,19,,RES SAINT MARTIN,A001,80260,80431,Hérissart,80,,,80431000AB0027,,,,,,,,,,,,,0,3,Dépendance,,0,J,jardins,,,715,2.412624,50.025387
2021-1372224,2021-12-20,000001,Vente,25000,,,VAL DU BOIS DE PUCHEVILLER,B070,80260,80431,Hérissart,80,,,80431000ZA0003,,,,,,,,,,,,,0,,,,,T,terres,,,3370,2.406382,50.042379
2021-1372224,2021-12-20,000001,Vente,25000,,,VAL DU BOIS DE PUCHEVILLER,B070,80260,80431,Hérissart,80,,,80431000ZA0004,,,,,,,,,,,,,0,,,,,T,terres,,,3460,2.406955,50.042625
2021-1372224,2021-12-20,000001,Vente,25000,,,VAL DU BOIS DE PUCHEVILLER,B070,80260,80431,Hérissart,80,,,80431000ZA0005,,,,,,,,,,,,,0,,,,,T,terres,,,3940,2.407429,50.042615
2021-1372235,2021-12-23,000001,Vente,52000,,,LE VILLAGE,B076,80260,80431,Hérissart,80,,,80431000AC0023,,,,,,,,,,,,,0,,,,,P,prés,,,960,2.418362,50.026646
2021-1372408,2021-01-04,000001,Vente,164500,,,LE VILLAGE,B076,80260,80431,Hérissart,80,,,80431000AA0168,,,,,,,,,,,,,0,,,,,AB,terrains a bâtir,,,1169,2.41406,50.029782
2021-1372408,2021-01-04,000001,Vente,164500,,,LE VILLAGE,B076,80260,80431,Hérissart,80,,,80431000AA0169,,,,,,,,,,,,,0,,,,,AB,terrains a bâtir,,,23,2.413747,50.029732
2021-1372531,2021-01-04,000001,Vente,212850,3,,RES SAINT MARTIN,A001,80260,80431,Hérissart,80,,,80431000AB0017,,,,,,,,,,,,,0,1,Maison,59,6,J,jardins,,,521,2.411389,50.026871
2021-1372531,2021-01-04,000001,Vente,212850,3,,RES SAINT MARTIN,A001,80260,80431,Hérissart,80,,,80431000AB0017,,,,,,,,,,,,,0,1,Maison,59,6,S,sols,,,500,2.411389,50.026871
2021-1372949,2021-03-02,000001,Vente,110000,9002,,RUE DU CHATEAU D'EAU,0027,80260,80431,Hérissart,80,,,80431000AC0018,,,,,,,,,,,,,0,1,Maison,77,4,S,sols,,,1406,2.417377,50.026791
2021-1372949,2021-03-02,000001,Vente,110000,9002,,RUE DU CHATEAU D'EAU,0027,80260,80431,Hérissart,80,,,80431000AC0018,,,,,,,,,,,,,0,1,Maison,61,2,S,sols,,,1406,2.417377,50.026791
2021-1372957,2021-03-08,000001,Vente,184000,15,B,RUE DE LA SAVONNIERE,0106,80260,80431,Hérissart,80,,,80431000AA0163,,,,,,,,,,,,,0,1,Maison,102,5,S,sols,,,849,2.414378,50.030199
2021-1372990,2021-03-09,000001,Vente,,3,,RUE DU CHATEAU D'EAU,0027,80260,80431,Hérissart,80,,,80431000AC0033,,,,,,,,,,,,,0,,,,,S,sols,,,38,2.418729,50.026331
2021-1373017,2021-03-09,000001,Vente,224000,9004,,RUE DU CHATEAU D'EAU,0027,80260,80431,Hérissart,80,,,80431000AC0032,,,,,,,,,,,,,0,1,Maison,72,2,S,sols,,,565,2.418546,50.026239
2021-1373105,2021-03-15,000001,Vente,203500,12,,VC LA RUELLE,0070,80260,80431,Hérissart,80,,,80431000AA0067,,,,,,,,,,,,,0,1,Maison,127,5,S,sols,,,635,2.415537,50.030222
2021-1373122,2021-03-25,000001,Vente,200200,14,,RES SAINT MARTIN,A001,80260,80431,Hérissart,80,,,80431000AB0046,,,,,,,,,,,,,0,1,Maison,104,6,S,sols,,,500,2.413605,50.025353
2021-1373122,2021-03-25,000001,Vente,200200,14,,RES SAINT MARTIN,A001,80260,80431,Hérissart,80,,,80431000AB0046,,,,,,,,,,,,,0,1,Maison,104,6,J,jardins,,,692,2.413605,50.025353
2021-1373205,2021-03-26,000001,Vente,75000,8,,RUE DU CHATEAU,0054,80260,80431,Hérissart,80,,,80431000AA0097,,,,,,,,,,,,,0,1,Maison,71,4,S,sols,,,711,2.416099,50.028401
2021-1373205,2021-03-26,000001,Vente,75000,8,,RUE DU CHATEAU,0054,80260,80431,Hérissart,80,,,80431000AA0097,,,,,,,,,,,,,0,3,Dépendance,,0,S,sols,,,711,2.416099,50.028401
2021-1373205,2021-03-26,000001,Vente,75000,8,,RUE DU CHATEAU,0054,80260,80431,Hérissart,80,,,80431000AA0097,,,,,,,,,,,,,0,3,Dépendance,,0,S,sols,,,711,2.416099,50.028401
2021-1373298,2021-03-19,000001,Vente,61440,,,LE VILLAGE,B076,80260,80431,Hérissart,80,,,80431000AA0162,,,,,,,,,,,,,0,,,,,AB,terrains a bâtir,,,1024,2.414377,50.030409
2021-1373300,2021-04-10,000001,Vente,12000,,,LA CRAIGNIERE,B031,80260,80431,Hérissart,80,,,80431000ZE0084,,,,,,,,,,,,,0,,,,,T,terres,,,2370,2.416198,50.016596
2021-1373300,2021-04-10,000001,Vente,12000,,,LA CRAIGNIERE,B031,80260,80431,Hérissart,80,,,80431000ZE0085,,,,,,,,,,,,,0,,,,,BF,futaies feuillues,,,3150,2.416705,50.015956
2021-1373300,2021-04-10,000001,Vente,12000,,,LA CRAIGNIERE,B031,80260,80431,Hérissart,80,,,80431000ZE0086,,,,,,,,,,,,,0,,,,,T,terres,,,2120,2.417276,50.015463
2021-1373300,2021-04-10,000001,Vente,12000,,,LA CRAIGNIERE,B031,80260,80431,Hérissart,80,,,80431000ZE0087,,,,,,,,,,,,,0,,,,,L,landes,,,930,2.416974,50.015394
2021-1373442,2021-04-21,000001,Vente,325.5,,,LE VILLAGE,B076,80260,80431,Hérissart,80,,,80431000AA0046,,,,,,,,,,,,,0,,,,,BS,taillis sous futaie,,,331,2.41724,50.030242
2021-1373444,2021-04-21,000001,Vente,912,,,LES PRES HELAINE,B062,80260,80431,Hérissart,80,,,80431000ZB0119,,,,,,,,,,,,,0,,,,,P,prés,,,736,2.420239,50.029628
2021-1373444,2021-04-21,000001,Vente,912,,,LES PRES HELAINE,B062,80260,80431,Hérissart,80,,,80431000ZB0119,,,,,,,,,,,,,0,,,,,P,prés,,,1474,2.420239,50.029628
2021-1373444,2021-04-21,000001,Vente,912,,,LES PRES HELAINE,B062,80260,80431,Hérissart,80,,,80431000ZB0123,,,,,,,,,,,,,0,,,,,BT,taillis simples,,,190,2.41984,50.029481
2021-1373486,2021-03-26,000001,Vente,40000,22,,GR GRANDE RUE,0051,80260,80431,Hérissart,80,,,80431000AC0045,,,,,,,,,,,,,0,3,Dépendance,,0,S,sols,,,1251,2.418511,50.025609
2021-1373962,2021-06-03,000001,Vente,8743,,,LE LARRY DU VIEUX MOULIN,B052,80260,80431,Hérissart,80,,,80431000ZB0136,,,,,,,,,,,,,0,,,,,T,terres,,,4440,2.427326,50.033191
2021-1374214,2021-06-21,000001,Vente,5307,,,LES CORTILLETS,B028,80260,80431,Hérissart,80,,,80431000ZD0156,,,,,,,,,,,,,0,,,,,T,terres,,,7370,2.438317,50.017763
2021-1374499,2021-07-05,000001,Vente,210000,17,,RES SAINT MARTIN,A001,80260,80431,Hérissart,80,,,80431000AB0026,,,,,,,,,,,,,0,1,Maison,110,6,S,sols,,,500,2.412487,50.025521
2021-1374499,2021-07-05,000001,Vente,210000,17,,RES SAINT MARTIN,A001,80260,80431,Hérissart,80,,,80431000AB0026,,,,,,,,,,,,,0,1,Maison,110,6,J,jardins,,,665,2.412487,50.025521
2021-1374608,2021-07-19,000001,Vente,185200,16,,RUE DU PARADIS,0058,80260,80431,Hérissart,80,,,80431000AD0004,,,,,,,,,,,,,0,1,Maison,89,4,S,sols,,,830,2.413777,50.024006
2021-1374659,2021-07-22,000001,Vente,266370,6,,CHE DE CORBIE,0032,80260,80431,Hérissart,80,,,80431000AD0061,,,,,,,,,,,,,0,1,Maison,108,6,J,jardins,,,1775,2.418442,50.023067
2021-1374659,2021-07-22,000001,Vente,266370,6,,CHE DE CORBIE,0032,80260,80431,Hérissart,80,,,80431000AD0061,,,,,,,,,,,,,0,1,Maison,108,6,S,sols,,,1000,2.418442,50.023067
2021-1374683,2021-06-29,000001,Vente,20000,,,LE VILLAGE,B076,80260,80431,Hérissart,80,,,80431000AB0098,,,,,,,,,,,,,0,,,,,P,prés,,,306,2.415386,50.026136
2021-1374813,2021-07-27,000001,Vente,45000,,,LES FRANCHES TERRES,B044,80260,80431,Hérissart,80,,,80431000ZA0180,,,,,,,,,,,,,0,,,,,T,terres,,,4362,2.412815,50.036057
2021-1374813,2021-07-27,000001,Vente,45000,,,LE CHEMIN DE CONTAY,B023,80260,80431,Hérissart,80,,,80431000ZC0113,,,,,,,,,,,,,0,,,,,T,terres,,,4040,2.430813,50.02266
2021-1374813,2021-07-27,000001,Vente,45000,,,LE CHEMIN DE CONTAY,B023,80260,80431,Hérissart,80,,,80431000ZC0114,,,,,,,,,,,,,0,,,,,T,terres,,,3120,2.43114,50.022623
2021-1374813,2021-07-27,000001,Vente,45000,,,DESSUS DU CHEMIN D ANICOUR,B034,80260,80431,Hérissart,80,,,80431000ZD0106,,,,,,,,,,,,,0,,,,,P,prés,,,2400,2.428053,50.021816
2021-1374813,2021-07-27,000001,Vente,45000,,,DESSUS DU CHEMIN D ANICOUR,B034,80260,80431,Hérissart,80,,,80431000ZD0106,,,,,,,,,,,,,0,,,,,P,prés,,,2400,2.428053,50.021816
2021-1374813,2021-07-27,000001,Vente,45000,,,DESSUS DU CHEMIN D ANICOUR,B034,80260,80431,Hérissart,80,,,80431000ZD0107,,,,,,,,,,,,,0,,,,,P,prés,,,2480,2.428381,50.021627
2021-1374813,2021-07-27,000001,Vente,45000,,,DESSUS DU CHEMIN D ANICOUR,B034,80260,80431,Hérissart,80,,,80431000ZD0107,,,,,,,,,,,,,0,,,,,P,prés,,,2480,2.428381,50.021627
2021-1374813,2021-07-27,000001,Vente,45000,,,LES CHAMPS AUX CAILLES,B015,80260,80431,Hérissart,80,,,80431000ZE0026,,,,,,,,,,,,,0,,,,,T,terres,,,9010,2.413137,50.021959
2021-1374813,2021-07-27,000001,Vente,45000,,,LES CHAMPS AUX CAILLES,B015,80260,80431,Hérissart,80,,,80431000ZE0037,,,,,,,,,,,,,0,,,,,T,terres,,,1200,2.415099,50.020452
2021-1374813,2021-07-27,000001,Vente,45000,,,LA CRAIGNIERE,B031,80260,80431,Hérissart,80,,,80431000ZE0081,,,,,,,,,,,,,0,,,,,T,terres,,,4920,2.417225,50.016422
2021-1374813,2021-07-27,000001,Vente,45000,,,DSU DU CHEMIN DE LA CRAIGN,B036,80260,80431,Hérissart,80,,,80431000ZE0098,,,,,,,,,,,,,0,,,,,T,terres,,,6680,2.420848,50.015382
2021-1374813,2021-07-27,000001,Vente,45000,,,DSU DU CHEMIN DE LA CRAIGN,B036,80260,80431,Hérissart,80,,,80431000ZE0099,,,,,,,,,,,,,0,,,,,T,terres,,,2680,2.421209,50.015218
2021-1374813,2021-07-27,000001,Vente,45000,,,DSU DU CHEMIN DE LA CRAIGN,B036,80260,80431,Hérissart,80,,,80431000ZE0099,,,,,,,,,,,,,0,,,,,T,terres,,,1340,2.421209,50.015218
2021-1374813,2021-07-27,000001,Vente,45000,,,LE FIEF POLET,B041,80260,80431,Hérissart,80,,,80431000ZE0112,,,,,,,,,,,,,0,,,,,T,terres,,,2452,2.420091,50.011896
2021-1374813,2021-07-27,000001,Vente,45000,,,LE FIEF POLET,B041,80260,80431,Hérissart,80,,,80431000ZE0112,,,,,,,,,,,,,0,,,,,T,terres,,,7358,2.420091,50.011896
2021-1374813,2021-07-27,000001,Vente,45000,,,LES CHAMPS AUX CAILLES,B015,80260,80431,Hérissart,80,,,80431000ZE0123,,,,,,,,,,,,,0,,,,,T,terres,,,5000,2.41489,50.020364
2021-1375264,2021-09-01,000001,Vente,220250,7,,RUE BRULEE,0022,80260,80431,Hérissart,80,,,80431000AB0126,,,,,,,,,,,,,0,3,Dépendance,,0,S,sols,,,653,2.416278,50.026593
2021-1375264,2021-09-01,000001,Vente,220250,7,,RUE BRULEE,0022,80260,80431,Hérissart,80,,,80431000AB0126,,,,,,,,,,,,,0,3,Dépendance,,0,S,sols,,,653,2.416278,50.026593
2021-1375264,2021-09-01,000001,Vente,220250,7,,RUE BRULEE,0022,80260,80431,Hérissart,80,,,80431000AB0126,,,,,,,,,,,,,0,3,Dépendance,,0,S,sols,,,653,2.416278,50.026593
2021-1375264,2021-09-01,000001,Vente,220250,7,,RUE BRULEE,0022,80260,80431,Hérissart,80,,,80431000AB0126,,,,,,,,,,,,,0,1,Maison,104,6,S,sols,,,653,2.416278,50.026593
2021-1375271,2021-09-08,000001,Vente,65900,,,LE VILLAGE,B076,80260,80431,Hérissart,80,,,80431000AA0166,,,,,,,,,,,,,0,,,,,AB,terrains a bâtir,,,5,2.413621,50.030045
2021-1375271,2021-09-08,000001,Vente,65900,,,LE VILLAGE,B076,80260,80431,Hérissart,80,,,80431000AA0167,,,,,,,,,,,,,0,,,,,AB,terrains a bâtir,,,1264,2.413963,50.029986
2021-1375537,2021-09-24,000001,Vente,233300,12,,RES SAINT MARTIN,A001,80260,80431,Hérissart,80,,,80431000AB0047,,,,,,,,,,,,,0,1,Maison,187,6,S,sols,,,500,2.41339,50.025798
2021-1375537,2021-09-24,000001,Vente,233300,12,,RES SAINT MARTIN,A001,80260,80431,Hérissart,80,,,80431000AB0047,,,,,,,,,,,,,0,1,Maison,187,6,J,jardins,,,566,2.41339,50.025798
2021-1376181,2021-11-05,000002,Vente,29000,8,,RUE DE CONTAY,0030,80260,80431,Hérissart,80,,,80431000AD0071,,,,,,,,,,,,,0,3,Dépendance,,0,S,sols,,,862,2.419584,50.023927
2021-1376181,2021-11-05,000002,Vente,29000,8,,RUE DE CONTAY,0030,80260,80431,Hérissart,80,,,80431000AD0071,,,,,,,,,,,,,0,3,Dépendance,,0,S,sols,,,862,2.419584,50.023927
