id_mutation,date_mutation,numero_disposition,nature_mutation,valeur_fonciere,adresse_numero,adresse_suffixe,adresse_nom_voie,adresse_code_voie,code_postal,code_commune,nom_commune,code_departement,ancien_code_commune,ancien_nom_commune,id_parcelle,ancien_id_parcelle,numero_volume,lot1_numero,lot1_surface_carrez,lot2_numero,lot2_surface_carrez,lot3_numero,lot3_surface_carrez,lot4_numero,lot4_surface_carrez,lot5_numero,lot5_surface_carrez,nombre_lots,code_type_local,type_local,surface_reelle_bati,nombre_pieces_principales,code_nature_culture,nature_culture,code_nature_culture_speciale,nature_culture_speciale,surface_terrain,longitude,latitude
2021-1365461,2021-01-18,000001,Vente,365000,14,,DERRIERE LE PRE,B011,80260,80661,Rainneville,80,,,80661000AB0181,,,,,,,,,,,,,0,1,Maison,170,5,S,sols,,,745,2.356692,49.968479
2021-1365461,2021-01-18,000001,Vente,365000,,,DERRIERE LE PRE,B011,80260,80661,Rainneville,80,,,80661000AB0239,,,,,,,,,,,,,0,,,,,P,prés,,,216,2.356809,49.968591
2021-1365466,2021-01-08,000001,Vente,58000,,,LE CLOS,B009,80260,80661,Rainneville,80,,,80661000AC0212,,,,,,,,,,,,,0,,,,,AB,terrains a bâtir,,,482,2.348335,49.969724
2021-1365512,2021-01-13,000001,Vente,31500,,,LE CLOS,B009,80260,80661,Rainneville,80,,,80661000AC0222,,,,,,,,,,,,,0,,,,,AB,terrains a bâtir,,,253,2.349629,49.970492
2021-1365516,2021-01-15,000001,Vente,37500,,,LE CLOS,B009,80260,80661,Rainneville,80,,,80661000AC0179,,,,,,,,,,,,,0,,,,,AB,terrains a bâtir,,,351,2.350144,49.969987
2021-1365516,2021-01-15,000001,Vente,37500,,,LE CLOS,B009,80260,80661,Rainneville,80,,,80661000AC0195,,,,,,,,,,,,,0,,,,,AB,terrains a bâtir,,,1,2.349967,49.970075
2021-1365530,2021-01-15,000001,Vente,61500,,,LE CLOS,B009,80260,80661,Rainneville,80,,,80661000AC0154,,,,,,,,,,,,,0,,,,,AB,terrains a bâtir,,,599,2.349684,49.968794
2021-1365626,2021-02-01,000001,Vente,210000,4,,DERRIERE LE PRE,B011,80260,80661,Rainneville,80,,,80661000ZH0230,,,,,,,,,,,,,0,1,Maison,133,5,S,sols,,,744,2.355999,49.967739
2021-1366034,2021-02-19,000001,Vente,43000,,,LE CLOS,B009,80260,80661,Rainneville,80,,,80661000AC0202,,,,,,,,,,,,,0,,,,,AB,terrains a bâtir,,,380,2.348831,49.969737
2021-1366100,2021-02-08,000001,Vente,57500,,,LE CLOS,B009,80260,80661,Rainneville,80,,,80661000AC0209,,,,,,,,,,,,,0,,,,,AB,terrains a bâtir,,,450,2.348658,49.969275
2021-1366345,2021-03-18,000001,Vente,57000,,,LE CLOS,B009,80260,80661,Rainneville,80,,,80661000AC0165,,,,,,,,,,,,,0,,,,,AB,terrains a bâtir,,,519,2.349231,49.969371
2021-1366345,2021-03-18,000001,Vente,57000,,,LE CLOS,B009,80260,80661,Rainneville,80,,,80661000AC0205,,,,,,,,,,,,,0,,,,,AB,terrains a bâtir,,,7,2.349038,49.969337
2021-1366346,2021-02-24,000001,Vente,39000,,,LE CLOS,B009,80260,80661,Rainneville,80,,,80661000AC0214,,,,,,,,,,,,,0,,,,,AB,terrains a bâtir,,,360,2.348528,49.969996
2021-1366347,2021-03-25,000001,Vente,39500,,,LE CLOS,B009,80260,80661,Rainneville,80,,,80661000AC0169,,,,,,,,,,,,,0,,,,,AB,terrains a bâtir,,,311,2.3495,49.969218
2021-1366349,2021-03-19,000001,Vente,59000,,,LE CLOS,B009,80260,80661,Rainneville,80,,,80661000AC0218,,,,,,,,,,,,,0,,,,,AB,terrains a bâtir,,,570,2.349196,49.970393
2021-1366412,2021-03-24,000002,Vente,65000,20,,RUE DE QUERRIEU,0120,80260,80661,Rainneville,80,,,80661000AB0273,,,,,,,,,,,,,0,,,,,P,prés,,,17,2.358569,49.970265
2021-1366412,2021-03-24,000002,Vente,65000,20,,RUE DE QUERRIEU,0120,80260,80661,Rainneville,80,,,80661000AB0276,,,,,,,,,,,,,0,,,,,P,prés,,,862,2.358368,49.970083
2021-1366472,2021-04-08,000001,Vente,58000,,,LE CLOS,B009,80260,80661,Rainneville,80,,,80661000AC0156,,,,,,,,,,,,,0,,,,,AB,terrains a bâtir,,,477,2.349486,49.968519
2021-1366659,2021-04-01,000001,Vente,135000,46,,RUE DE PIERREGOT,0080,80260,80661,Rainneville,80,,,80661000AA0196,,,,,,,,,,,,,0,1,Maison,108,6,J,jardins,,,367,2.357882,49.97611
2021-1366659,2021-04-01,000001,Vente,135000,46,,RUE DE PIERREGOT,0080,80260,80661,Rainneville,80,,,80661000AA0196,,,,,,,,,,,,,0,1,Maison,108,6,S,sols,,,531,2.357882,49.97611
2021-1366659,2021-04-01,000001,Vente,135000,46,,RUE DE PIERREGOT,0080,80260,80661,Rainneville,80,,,80661000AA0196,,,,,,,,,,,,,0,3,Dépendance,,0,J,jardins,,,367,2.357882,49.97611
2021-1366659,2021-04-01,000001,Vente,135000,46,,RUE DE PIERREGOT,0080,80260,80661,Rainneville,80,,,80661000AA0196,,,,,,,,,,,,,0,3,Dépendance,,0,S,sols,,,531,2.357882,49.97611
2021-1366659,2021-04-01,000001,Vente,135000,46,,RUE DE PIERREGOT,0080,80260,80661,Rainneville,80,,,80661000AA0196,,,,,,,,,,,,,0,3,Dépendance,,0,J,jardins,,,367,2.357882,49.97611
2021-1366659,2021-04-01,000001,Vente,135000,46,,RUE DE PIERREGOT,0080,80260,80661,Rainneville,80,,,80661000AA0196,,,,,,,,,,,,,0,3,Dépendance,,0,J,jardins,,,367,2.357882,49.97611
2021-1366659,2021-04-01,000001,Vente,135000,46,,RUE DE PIERREGOT,0080,80260,80661,Rainneville,80,,,80661000AA0196,,,,,,,,,,,,,0,3,Dépendance,,0,S,sols,,,531,2.357882,49.97611
2021-1366659,2021-04-01,000001,Vente,135000,46,,RUE DE PIERREGOT,0080,80260,80661,Rainneville,80,,,80661000AA0196,,,,,,,,,,,,,0,3,Dépendance,,0,S,sols,,,531,2.357882,49.97611
2021-1366982,2021-04-29,000001,Vente,57500,,,LE CLOS,B009,80260,80661,Rainneville,80,,,80661000AC0176,,,,,,,,,,,,,0,,,,,AB,terrains a bâtir,,,555,2.349858,49.969896
2021-1366982,2021-04-29,000001,Vente,57500,,,LE CLOS,B009,80260,80661,Rainneville,80,,,80661000AC0198,,,,,,,,,,,,,0,,,,,AB,terrains a bâtir,,,11,2.349708,49.969872
2021-1367073,2021-05-26,000001,Vente,57500,,,LE CLOS,B009,80260,80661,Rainneville,80,,,80661000AC0164,,,,,,,,,,,,,0,,,,,AB,terrains a bâtir,,,156,2.348886,49.969172
2021-1367073,2021-05-26,000001,Vente,57500,,,LE CLOS,B009,80260,80661,Rainneville,80,,,80661000AC0207,,,,,,,,,,,,,0,,,,,AB,terrains a bâtir,,,304,2.348713,49.969159
2021-1367250,2021-05-17,000001,Vente,58000,,,LE CLOS,B009,80260,80661,Rainneville,80,,,80661000AC0210,,,,,,,,,,,,,0,,,,,AB,terrains a bâtir,,,462,2.348523,49.969418
2021-1367573,2021-05-28,000001,Vente,64000,,,LE CLOS,B009,80260,80661,Rainneville,80,,,80661000AC0190,,,,,,,,,,,,,0,,,,,AB,terrains a bâtir,,,595,2.350061,49.970753
2021-1367791,2021-06-29,000001,Vente,62000,,,LE CLOS,B009,80260,80661,Rainneville,80,,,80661000AC0158,,,,,,,,,,,,,0,,,,,AB,terrains a bâtir,,,606,2.349193,49.968152
2021-1368051,2021-07-12,000001,Vente,227000,8,,CHEMIN DE CARDONNETTE,B042,80260,80661,Rainneville,80,,,80661000AB0250,,,,,,,,,,,,,0,3,Dépendance,,0,S,sols,,,500,2.353667,49.968697
2021-1368051,2021-07-12,000001,Vente,227000,8,,CHEMIN DE CARDONNETTE,B042,80260,80661,Rainneville,80,,,80661000AB0250,,,,,,,,,,,,,0,1,Maison,92,5,AG,terrains d'agrément,,,1321,2.353667,49.968697
2021-1368051,2021-07-12,000001,Vente,227000,8,,CHEMIN DE CARDONNETTE,B042,80260,80661,Rainneville,80,,,80661000AB0250,,,,,,,,,,,,,0,3,Dépendance,,0,AG,terrains d'agrément,,,1321,2.353667,49.968697
2021-1368051,2021-07-12,000001,Vente,227000,8,,CHEMIN DE CARDONNETTE,B042,80260,80661,Rainneville,80,,,80661000AB0250,,,,,,,,,,,,,0,3,Dépendance,,0,AG,terrains d'agrément,,,1321,2.353667,49.968697
2021-1368051,2021-07-12,000001,Vente,227000,8,,CHEMIN DE CARDONNETTE,B042,80260,80661,Rainneville,80,,,80661000AB0250,,,,,,,,,,,,,0,1,Maison,92,5,S,sols,,,500,2.353667,49.968697
2021-1368051,2021-07-12,000001,Vente,227000,8,,CHEMIN DE CARDONNETTE,B042,80260,80661,Rainneville,80,,,80661000AB0250,,,,,,,,,,,,,0,3,Dépendance,,0,S,sols,,,500,2.353667,49.968697
2021-1368133,2021-06-22,000001,Vente,56500,,,LE CLOS,B009,80260,80661,Rainneville,80,,,80661000AC0185,,,,,,,,,,,,,0,,,,,AB,terrains a bâtir,,,544,2.350828,49.970321
2021-1368187,2021-07-02,000001,Vente,346800,,,LE BOUT DE LA RUE DE PIERR,B002,80260,80661,Rainneville,80,,,80661000ZC0144,,,,,,,,,,,,,0,,,,,P,prés,,,22,2.358753,49.977599
2021-1368187,2021-07-02,000001,Vente,346800,60,,RUE DE PIERREGOT,0080,80260,80661,Rainneville,80,,,80661000ZC0152,,,,,,,,,,,,,0,1,Maison,190,6,S,sols,,,800,2.359053,49.977502
2021-1368333,2021-07-02,000001,Vente,64500,,,LE CLOS,B009,80260,80661,Rainneville,80,,,80661000AC0177,,,,,,,,,,,,,0,,,,,AB,terrains a bâtir,,,21,2.349929,49.970035
2021-1368333,2021-07-02,000001,Vente,64500,,,LE CLOS,B009,80260,80661,Rainneville,80,,,80661000AC0196,,,,,,,,,,,,,0,,,,,AB,terrains a bâtir,,,618,2.349732,49.970013
2021-1368334,2021-07-20,000001,Vente,59500,,,LE CLOS,B009,80260,80661,Rainneville,80,,,80661000AC0217,,,,,,,,,,,,,0,,,,,AB,terrains a bâtir,,,571,2.349001,49.970277
2021-1368637,2021-08-04,000001,Vente,60000,,,LE CLOS,B009,80260,80661,Rainneville,80,,,80661000AC0161,,,,,,,,,,,,,0,,,,,AB,terrains a bâtir,,,531,2.349124,49.968726
2021-1368732,2021-08-26,000001,Vente,349000,20,,RUE DE ST GRATIEN,0123,80260,80661,Rainneville,80,,,80661000ZH0206,,,,,,,,,,,,,0,1,Maison,193,6,S,sols,,,500,2.359466,49.97283
2021-1368732,2021-08-26,000001,Vente,349000,20,,RUE DE ST GRATIEN,0123,80260,80661,Rainneville,80,,,80661000ZH0206,,,,,,,,,,,,,0,1,Maison,193,6,J,jardins,,,803,2.359466,49.97283
2021-1368861,2021-08-24,000001,Vente,215000,29,,LOT LE CLOS,0067,80260,80661,Rainneville,80,,,80661000AC0100,,,,,,,,,,,,,0,1,Maison,88,5,S,sols,,,802,2.349907,49.96774
2021-1369442,2021-10-04,000001,Vente,58000,,,LE CLOS,B009,80260,80661,Rainneville,80,,,80661000AC0162,,,,,,,,,,,,,0,,,,,AB,terrains a bâtir,,,458,2.34891,49.968863
2021-1369443,2021-10-04,000001,Vente,60000,,,LE CLOS,B009,80260,80661,Rainneville,80,,,80661000AC0166,,,,,,,,,,,,,0,,,,,AB,terrains a bâtir,,,49,2.349285,49.969516
2021-1369443,2021-10-04,000001,Vente,60000,,,LE CLOS,B009,80260,80661,Rainneville,80,,,80661000AC0204,,,,,,,,,,,,,0,,,,,AB,terrains a bâtir,,,539,2.349069,49.969482
2021-1369717,2021-10-15,000001,Vente,58000,,,LE CLOS,B009,80260,80661,Rainneville,80,,,80661000AC0216,,,,,,,,,,,,,0,,,,,AB,terrains a bâtir,,,540,2.348811,49.970164
2021-1369806,2021-10-04,000001,Vente,63500,,,LE CLOS,B009,80260,80661,Rainneville,80,,,80661000AC0192,,,,,,,,,,,,,0,,,,,AB,terrains a bâtir,,,614,2.350153,49.970481
2021-1369991,2021-10-22,000001,Vente,41000,,,LE CLOS,B009,80260,80661,Rainneville,80,,,80661000AC0168,,,,,,,,,,,,,0,,,,,AB,terrains a bâtir,,,338,2.349413,49.969147
2021-1370118,2021-10-22,000001,Vente,205000,9,,LE CHEMIN VERT,B008,80260,80661,Rainneville,80,,,80661000ZH0253,,,,,,,,,,,,,0,1,Maison,76,4,S,sols,,,664,2.360625,49.97218
2021-1370120,2021-11-04,000001,Vente,51000,,,LE CLOS,B009,80260,80661,Rainneville,80,,,80661000AC0167,,,,,,,,,,,,,0,,,,,AB,terrains a bâtir,,,419,2.349245,49.969122
2021-1370274,2021-10-26,000001,Vente,63500,,,LE CLOS,B009,80260,80661,Rainneville,80,,,80661000AC0150,,,,,,,,,,,,,0,,,,,AB,terrains a bâtir,,,568,2.350316,49.969497
2021-1370917,2021-11-16,000001,Vente,54500,,,LE CLOS,B009,80260,80661,Rainneville,80,,,80661000AC0171,,,,,,,,,,,,,0,,,,,AB,terrains a bâtir,,,484,2.349893,49.969487
2021-1371403,2021-11-26,000001,Vente,38000,,,LE CLOS,B009,80260,80661,Rainneville,80,,,80661000AC0180,,,,,,,,,,,,,0,,,,,AB,terrains a bâtir,,,331,2.350303,49.970049
2021-1371426,2021-12-20,000001,Vente,220000,5147,F,CHEMIN DE CARDONNETTE,B042,80260,80661,Rainneville,80,,,80661000AB0147,,,,,,,,,,,,,0,1,Maison,88,4,S,sols,,,983,2.355045,49.96926
