id_mutation,date_mutation,numero_disposition,nature_mutation,valeur_fonciere,adresse_numero,adresse_suffixe,adresse_nom_voie,adresse_code_voie,code_postal,code_commune,nom_commune,code_departement,ancien_code_commune,ancien_nom_commune,id_parcelle,ancien_id_parcelle,numero_volume,lot1_numero,lot1_surface_carrez,lot2_numero,lot2_surface_carrez,lot3_numero,lot3_surface_carrez,lot4_numero,lot4_surface_carrez,lot5_numero,lot5_surface_carrez,nombre_lots,code_type_local,type_local,surface_reelle_bati,nombre_pieces_principales,code_nature_culture,nature_culture,code_nature_culture_speciale,nature_culture_speciale,surface_terrain,longitude,latitude
2021-1378094,2021-06-19,000001,Vente,100000,,,LE VILLAGE,B021,80190,80683,Rouy-le-Grand,80,,,806830000A0245,,,,,,,,,,,,,0,,,,,S,sols,,,26,2.961865,49.777031
2021-1378094,2021-06-19,000001,Vente,100000,54,,GR GRANDE RUE,0004,80190,80683,Rouy-le-Grand,80,,,806830000A0246,,,,,,,,,,,,,0,1,Maison,200,7,S,sols,,,629,2.962128,49.776992
2021-1378094,2021-06-19,000001,Vente,100000,54,,GR GRANDE RUE,0004,80190,80683,Rouy-le-Grand,80,,,806830000A0246,,,,,,,,,,,,,0,3,Dépendance,,0,S,sols,,,629,2.962128,49.776992
2021-1378094,2021-06-19,000001,Vente,100000,54,,GR GRANDE RUE,0004,80190,80683,Rouy-le-Grand,80,,,806830000A0246,,,,,,,,,,,,,0,3,Dépendance,,0,S,sols,,,629,2.962128,49.776992
2021-1378094,2021-06-19,000001,Vente,100000,54,,GR GRANDE RUE,0004,80190,80683,Rouy-le-Grand,80,,,806830000A0246,,,,,,,,,,,,,0,3,Dépendance,,0,S,sols,,,629,2.962128,49.776992
2021-1378094,2021-06-19,000001,Vente,100000,54,,GR GRANDE RUE,0004,80190,80683,Rouy-le-Grand,80,,,806830000A0246,,,,,,,,,,,,,0,3,Dépendance,,0,S,sols,,,629,2.962128,49.776992
2021-1378094,2021-06-19,000001,Vente,100000,,,GR GRANDE RUE,0004,80190,80683,Rouy-le-Grand,80,,,806830000A0247,,,,,,,,,,,,,0,,,,,S,sols,,,409,2.962219,49.777132
2021-1378094,2021-06-19,000001,Vente,100000,,,LE VILLAGE,B021,80190,80683,Rouy-le-Grand,80,,,806830000A0251,,,,,,,,,,,,,0,,,,,J,jardins,,,95,2.962483,49.777049
2021-1378094,2021-06-19,000001,Vente,100000,,,LE VILLAGE,B021,80190,80683,Rouy-le-Grand,80,,,806830000A0252,,,,,,,,,,,,,0,,,,,J,jardins,,,147,2.962359,49.776926
