id_mutation,date_mutation,numero_disposition,nature_mutation,valeur_fonciere,adresse_numero,adresse_suffixe,adresse_nom_voie,adresse_code_voie,code_postal,code_commune,nom_commune,code_departement,ancien_code_commune,ancien_nom_commune,id_parcelle,ancien_id_parcelle,numero_volume,lot1_numero,lot1_surface_carrez,lot2_numero,lot2_surface_carrez,lot3_numero,lot3_surface_carrez,lot4_numero,lot4_surface_carrez,lot5_numero,lot5_surface_carrez,nombre_lots,code_type_local,type_local,surface_reelle_bati,nombre_pieces_principales,code_nature_culture,nature_culture,code_nature_culture_speciale,nature_culture_speciale,surface_terrain,longitude,latitude
2021-1365413,2021-01-09,000001,Vente,65000,194,,RUE DU ONZE NOVEMBRE,0190,80140,80732,Senarpont,80,,,80732000AK0020,,,,,,,,,,,,,0,4,Local industriel. commercial ou assimilé,,0,S,sols,,,863,1.718361,49.890694
2021-1365413,2021-01-09,000001,Vente,65000,194,,RUE DU ONZE NOVEMBRE,0190,80140,80732,Senarpont,80,,,80732000AK0020,,,,,,,,,,,,,0,1,Maison,84,6,S,sols,,,863,1.718361,49.890694
2021-1365413,2021-01-09,000001,Vente,65000,,,A LA PLANCHE GODARD,B042,80140,80732,Senarpont,80,,,80732000AK0021,,,,,,,,,,,,,0,,,,,P,prés,,,298,1.719133,49.890461
2021-1365413,2021-01-09,000001,Vente,65000,,,A LA PLANCHE GODARD,B042,80140,80732,Senarpont,80,,,80732000AK0314,,,,,,,,,,,,,0,,,,,P,prés,,,4294,1.718796,49.890738
2021-1365738,2021-02-18,000001,Vente,90000,143,,L ENCLOS SELLECQUE,B027,80140,80732,Senarpont,80,,,80732000AK0190,,,,,,,,,,,,,0,1,Maison,91,5,S,sols,,,730,1.714616,49.891072
2021-1366471,2021-04-13,000001,Vente,158000,262,,RUE SAINT CLAUDE,0260,80140,80732,Senarpont,80,,,80732000AL0156,,,,,,,,,,,,,0,1,Maison,160,5,S,sols,,,825,1.721968,49.886202
2021-1366471,2021-04-13,000001,Vente,158000,262,,RUE SAINT CLAUDE,0260,80140,80732,Senarpont,80,,,80732000AL0156,,,,,,,,,,,,,0,1,Maison,160,5,P,prés,,,876,1.721968,49.886202
2021-1366761,2021-05-06,000001,Vente,90000,95,,RTE DU TREPORT,0280,80140,80732,Senarpont,80,,,80732000AK0167,,,,,,,,,,,,,0,1,Maison,68,4,S,sols,,,725,1.716454,49.891538
2021-1366971,2021-05-07,000001,Vente,84000,6,,L ENCLOS SELLECQUE,B027,80140,80732,Senarpont,80,,,80732000AK0165,,,,,,,,,,,,,0,1,Maison,82,5,S,sols,,,719,1.715751,49.891636
2021-1366971,2021-05-07,000001,Vente,84000,,,L ENCLOS SELLECQUE,B027,80140,80732,Senarpont,80,,,80732000AK0169,,,,,,,,,,,,,0,,,,,S,sols,,,704,1.716038,49.891514
2021-1367408,2021-05-28,000001,Vente,150000,60,,PL DU GENERAL LECLERC,0145,80140,80732,Senarpont,80,,,80732000AL0128,,,,,,,,,,,,,0,1,Maison,126,4,S,sols,,,661,,
2021-1367408,2021-05-28,000001,Vente,150000,60,,PL DU GENERAL LECLERC,0145,80140,80732,Senarpont,80,,,80732000AL0128,,,,,,,,,,,,,0,4,Local industriel. commercial ou assimilé,67,0,S,sols,,,661,,
2021-1367408,2021-05-28,000001,Vente,150000,60,,PL DU GENERAL LECLERC,0145,80140,80732,Senarpont,80,,,80732000AL0128,,,,,,,,,,,,,0,3,Dépendance,,0,S,sols,,,661,,
2021-1367408,2021-05-28,000001,Vente,150000,60,,PL DU GENERAL LECLERC,0145,80140,80732,Senarpont,80,,,80732000AL0128,,,,,,,,,,,,,0,1,Maison,57,4,S,sols,,,661,,
2021-1368509,2021-07-27,000001,Vente,85000,66,,RUE DU ONZE NOVEMBRE,0190,80140,80732,Senarpont,80,,,80732000AK0289,,,,,,,,,,,,,0,,,,,S,sols,,,216,1.718828,49.88957
2021-1368509,2021-07-27,000001,Vente,85000,66,,RUE DU ONZE NOVEMBRE,0190,80140,80732,Senarpont,80,,,80732000AK0301,,,,,,,,,,,,,0,3,Dépendance,,0,S,sols,,,170,1.718782,49.889623
2021-1368509,2021-07-27,000001,Vente,85000,66,,RUE DU ONZE NOVEMBRE,0190,80140,80732,Senarpont,80,,,80732000AK0301,,,,,,,,,,,,,0,1,Maison,67,3,S,sols,,,170,1.718782,49.889623
2021-1368619,2021-08-10,000001,Vente,66000,839,,RUE SAINT CLAUDE,0260,80140,80732,Senarpont,80,,,80732000AL0034,,,,,,,,,,,,,0,3,Dépendance,,0,S,sols,,,334,1.726026,49.881804
2021-1368619,2021-08-10,000001,Vente,66000,839,,RUE SAINT CLAUDE,0260,80140,80732,Senarpont,80,,,80732000AL0034,,,,,,,,,,,,,0,1,Maison,90,4,S,sols,,,334,1.726026,49.881804
2021-1369079,2021-09-20,000001,Vente,37000,40,,RUE DU PONT,0220,80140,80732,Senarpont,80,,,80732000AK0118,,,,,,,,,,,,,0,1,Maison,109,4,S,sols,,,207,1.718263,49.889249
2021-1369079,2021-09-20,000001,Vente,37000,40,,RUE DU PONT,0220,80140,80732,Senarpont,80,,,80732000AK0118,,,,,,,,,,,,,0,3,Dépendance,,0,S,sols,,,207,1.718263,49.889249
2021-1369624,2021-10-09,000001,Vente,193000,575,,RUE SAINT CLAUDE,0260,80140,80732,Senarpont,80,,,80732000AL0287,,,,,,,,,,,,,0,1,Maison,155,5,S,sols,,,1530,1.724644,49.883738
2021-1369858,2021-09-29,000001,Vente,123025,,,BOIS DU PARC,B004,80140,80732,Senarpont,80,,,80732000AN0131,,,,,,,,,,,,,0,,,,,BS,taillis sous futaie,,,61512,1.723444,49.878215
2021-1371495,2021-12-17,000001,Vente,127000,748,,RUE SAINT CLAUDE,0260,80140,80732,Senarpont,80,,,80732000AL0046,,,,,,,,,,,,,0,1,Maison,80,4,S,sols,,,369,1.724543,49.882143
2021-1371495,2021-12-17,000001,Vente,127000,748,,RUE SAINT CLAUDE,0260,80140,80732,Senarpont,80,,,80732000AL0046,,,,,,,,,,,,,0,1,Maison,80,4,J,jardins,,,844,1.724543,49.882143
2021-1371562,2021-12-24,000001,Vente,59500,106,,RUE BRULEE,0080,80140,80732,Senarpont,80,,,80732000AL0105,,,,,,,,,,,,,0,1,Maison,61,3,S,sols,,,238,1.718668,49.887762
2021-1372049,2021-12-21,000001,Vente,60000,,,LE VILLAGE,B057,80140,80732,Senarpont,80,,,80732000AL0006,,,,,,,,,,,,,0,,,,,J,jardins,,,547,1.722791,49.886233
2021-1372049,2021-12-21,000001,Vente,60000,301,,RUE SAINT CLAUDE,0260,80140,80732,Senarpont,80,,,80732000AL0007,,,,,,,,,,,,,0,1,Maison,80,4,S,sols,,,250,1.722868,49.88614
2021-1372204,2021-12-27,000001,Vente,70000,57,,RUE DU 8 MAI 1945,0148,80140,80732,Senarpont,80,,,80732000AL0119,,,,,,,,,,,,,0,1,Maison,52,3,S,sols,,,278,1.718124,49.888567
