id_mutation,date_mutation,numero_disposition,nature_mutation,valeur_fonciere,adresse_numero,adresse_suffixe,adresse_nom_voie,adresse_code_voie,code_postal,code_commune,nom_commune,code_departement,ancien_code_commune,ancien_nom_commune,id_parcelle,ancien_id_parcelle,numero_volume,lot1_numero,lot1_surface_carrez,lot2_numero,lot2_surface_carrez,lot3_numero,lot3_surface_carrez,lot4_numero,lot4_surface_carrez,lot5_numero,lot5_surface_carrez,nombre_lots,code_type_local,type_local,surface_reelle_bati,nombre_pieces_principales,code_nature_culture,nature_culture,code_nature_culture_speciale,nature_culture_speciale,surface_terrain,longitude,latitude
2021-1371922,2021-12-23,000001,Vente,15000,,,LA VALLEE BAZARD,B024,80240,80748,Templeux-le-Guérard,80,,,80748000ZD0025,,,,,,,,,,,,,0,,,,,BT,taillis simples,,,10600,3.139369,49.953698
2021-1378016,2021-06-03,000001,Vente,1909,,,LA VALLEE D HARGICOURT,B025,80240,80748,Templeux-le-Guérard,80,,,80748000ZC0027,,,,,,,,,,,,,0,,,,,T,terres,,,2700,3.161371,49.955791
2021-1378344,2021-07-17,000001,Vente,5754,,,AU BOSQUET DES BOULEAUX,B004,80240,80748,Templeux-le-Guérard,80,,,80748000ZA0031,,,,,,,,,,,,,0,,,,,T,terres,,,8220,3.144165,49.973062
2021-1378943,2021-11-04,000001,Vente,270000,1,,RUE DE L ORMISSEL,0120,80240,80748,Templeux-le-Guérard,80,,,80748000AB0097,,,,,,,,,,,,,0,3,Dépendance,,0,P,prés,,,3288,3.149531,49.963258
2021-1378943,2021-11-04,000001,Vente,270000,1,,RUE DE L ORMISSEL,0120,80240,80748,Templeux-le-Guérard,80,,,80748000AB0097,,,,,,,,,,,,,0,1,Maison,226,7,P,prés,,,3288,3.149531,49.963258
2021-1378943,2021-11-04,000001,Vente,270000,1,,RUE DE L ORMISSEL,0120,80240,80748,Templeux-le-Guérard,80,,,80748000AB0097,,,,,,,,,,,,,0,3,Dépendance,,0,S,sols,,,3409,3.149531,49.963258
2021-1378943,2021-11-04,000001,Vente,270000,1,,RUE DE L ORMISSEL,0120,80240,80748,Templeux-le-Guérard,80,,,80748000AB0097,,,,,,,,,,,,,0,3,Dépendance,,0,S,sols,,,3409,3.149531,49.963258
2021-1378943,2021-11-04,000001,Vente,270000,1,,RUE DE L ORMISSEL,0120,80240,80748,Templeux-le-Guérard,80,,,80748000AB0097,,,,,,,,,,,,,0,1,Maison,226,7,S,sols,,,3409,3.149531,49.963258
2021-1378943,2021-11-04,000001,Vente,270000,1,,RUE DE L ORMISSEL,0120,80240,80748,Templeux-le-Guérard,80,,,80748000AB0097,,,,,,,,,,,,,0,3,Dépendance,,0,P,prés,,,3288,3.149531,49.963258
