id_mutation,date_mutation,numero_disposition,nature_mutation,valeur_fonciere,adresse_numero,adresse_suffixe,adresse_nom_voie,adresse_code_voie,code_postal,code_commune,nom_commune,code_departement,ancien_code_commune,ancien_nom_commune,id_parcelle,ancien_id_parcelle,numero_volume,lot1_numero,lot1_surface_carrez,lot2_numero,lot2_surface_carrez,lot3_numero,lot3_surface_carrez,lot4_numero,lot4_surface_carrez,lot5_numero,lot5_surface_carrez,nombre_lots,code_type_local,type_local,surface_reelle_bati,nombre_pieces_principales,code_nature_culture,nature_culture,code_nature_culture_speciale,nature_culture_speciale,surface_terrain,longitude,latitude
2021-1373499,2021-04-07,000001,Vente,184650,5042,,RUE MICHEL LEGRY,0045,80135,80830,Yaucourt-Bussus,80,,,808300000B0657,,,,,,,,,,,,,0,1,Maison,170,6,S,sols,,,936,1.976693,50.103981
2021-1373499,2021-04-07,000001,Vente,184650,,,LE VILLAGE,B045,80135,80830,Yaucourt-Bussus,80,,,808300000B0659,,,,,,,,,,,,,0,,,,,S,sols,,,427,1.976627,50.103897
2021-1374162,2021-06-03,000001,Vente,90000,,,LE VILLAGE,B045,80135,80830,Yaucourt-Bussus,80,,,808300000B0606,,,,,,,,,,,,,0,,,,,S,sols,,,22,1.975359,50.105955
2021-1374162,2021-06-03,000001,Vente,90000,,,LE VILLAGE,B045,80135,80830,Yaucourt-Bussus,80,,,808300000B0608,,,,,,,,,,,,,0,,,,,S,sols,,,40,1.975373,50.106037
2021-1374162,2021-06-03,000001,Vente,90000,5016,,RUE DU PETIT PRE,0050,80135,80830,Yaucourt-Bussus,80,,,808300000B0610,,,,,,,,,,,,,0,1,Maison,51,1,S,sols,,,284,1.975501,50.106069
2021-1374162,2021-06-03,000001,Vente,90000,5016,,RUE DU PETIT PRE,0050,80135,80830,Yaucourt-Bussus,80,,,808300000B0610,,,,,,,,,,,,,0,3,Dépendance,,0,S,sols,,,284,1.975501,50.106069
2021-1374464,2021-07-06,000001,Vente,157000,,,LE VILLAGE,B045,80135,80830,Yaucourt-Bussus,80,,,808300000B0271,,,,,,,,,,,,,0,,,,,P,prés,,,1375,1.973376,50.105307
2021-1374464,2021-07-06,000001,Vente,157000,,,LE VILLAGE,B045,80135,80830,Yaucourt-Bussus,80,,,808300000B0272,,,,,,,,,,,,,0,,,,,BT,taillis simples,,,2790,1.973439,50.105108
2021-1374464,2021-07-06,000001,Vente,157000,,,LE VILLAGE,B045,80135,80830,Yaucourt-Bussus,80,,,808300000B0461,,,,,,,,,,,,,0,,,,,P,prés,,,9434,1.974154,50.104952
2021-1374464,2021-07-06,000001,Vente,157000,,,LE VILLAGE,B045,80135,80830,Yaucourt-Bussus,80,,,808300000B0462,,,,,,,,,,,,,0,,,,,S,sols,,,28,1.975093,50.104502
2021-1374464,2021-07-06,000001,Vente,157000,,,LE VILLAGE,B045,80135,80830,Yaucourt-Bussus,80,,,808300000B0462,,,,,,,,,,,,,0,,,,,P,prés,,,3306,1.975093,50.104502
2021-1374464,2021-07-06,000001,Vente,157000,,,LE VILLAGE,B045,80135,80830,Yaucourt-Bussus,80,,,808300000B0463,,,,,,,,,,,,,0,,,,,J,jardins,,,441,1.974737,50.104166
2021-1374464,2021-07-06,000001,Vente,157000,,,LE VILLAGE,B045,80135,80830,Yaucourt-Bussus,80,,,808300000B0464,,,,,,,,,,,,,0,,,,,J,jardins,,,449,1.974573,50.104059
2021-1374464,2021-07-06,000001,Vente,157000,5010,,RUE DU PETIT PRE,0050,80135,80830,Yaucourt-Bussus,80,,,808300000B0619,,,,,,,,,,,,,0,1,Maison,129,5,S,sols,,,1674,1.975434,50.104779
2021-1374464,2021-07-06,000001,Vente,157000,,,LE VILLAGE,B045,80135,80830,Yaucourt-Bussus,80,,,808300000B0620,,,,,,,,,,,,,0,,,,,S,sols,,,5,1.975455,50.104518
2021-1374464,2021-07-06,000001,Vente,157000,,,LE VILLAGE,B045,80135,80830,Yaucourt-Bussus,80,,,808300000B0681,,,,,,,,,,,,,0,,,,,P,prés,,,39,1.975876,50.104813
2021-1374464,2021-07-06,000001,Vente,157000,,,LE VILLAGE,B045,80135,80830,Yaucourt-Bussus,80,,,808300000B0682,,,,,,,,,,,,,0,,,,,P,prés,,,125,1.975641,50.104639
2021-1374592,2021-02-16,000001,Adjudication,41000,,,LE PRE JEAN SELLIER,B032,80135,80830,Yaucourt-Bussus,80,,,808300000B0495,,,,,,,,,,,,,0,,,,,S,sols,,,389,1.985814,50.104061
2021-1374592,2021-02-16,000001,Adjudication,41000,36,,RUE DU ONZE NOVEMBRE,0048,80135,80830,Yaucourt-Bussus,80,,,808300000B0496,,,,,,,,,,,,,0,1,Maison,55,2,S,sols,,,1053,1.985595,50.103663
2021-1374592,2021-02-16,000001,Adjudication,41000,36,,RUE DU ONZE NOVEMBRE,0048,80135,80830,Yaucourt-Bussus,80,,,808300000B0496,,,,,,,,,,,,,0,1,Maison,55,2,J,jardins,,,2625,1.985595,50.103663
2021-1375367,2021-09-09,000001,Vente,135000,35,,RUE MICHEL LEGRY,0045,80135,80830,Yaucourt-Bussus,80,,,808300000B0492,,,,,,,,,,,,,0,1,Maison,71,3,S,sols,,,555,1.9733,50.101806
2021-1376194,2021-11-09,000001,Vente,1000,,,TERRE NEUVILLE,B041,80135,80830,Yaucourt-Bussus,80,,,80830000ZC0003,,,,,,,,,,,,,0,,,,,BT,taillis simples,,,390,1.984651,50.106541
2021-1376194,2021-11-09,000001,Vente,1000,,,TERRE NEUVILLE,B041,80135,80830,Yaucourt-Bussus,80,,,80830000ZC0004,,,,,,,,,,,,,0,,,,,BT,taillis simples,,,340,1.984696,50.106649
