id_mutation,date_mutation,numero_disposition,nature_mutation,valeur_fonciere,adresse_numero,adresse_suffixe,adresse_nom_voie,adresse_code_voie,code_postal,code_commune,nom_commune,code_departement,ancien_code_commune,ancien_nom_commune,id_parcelle,ancien_id_parcelle,numero_volume,lot1_numero,lot1_surface_carrez,lot2_numero,lot2_surface_carrez,lot3_numero,lot3_surface_carrez,lot4_numero,lot4_surface_carrez,lot5_numero,lot5_surface_carrez,nombre_lots,code_type_local,type_local,surface_reelle_bati,nombre_pieces_principales,code_nature_culture,nature_culture,code_nature_culture_speciale,nature_culture_speciale,surface_terrain,longitude,latitude
2021-1379907,2021-02-03,000001,Vente,270000,5040,,SAINT PELUQUET,B041,81500,81213,Pratviel,81,,,81213000ZC0033,,,,,,,,,,,,,0,1,Maison,147,6,S,sols,,,800,1.881956,43.638074
2021-1379907,2021-02-03,000001,Vente,270000,5040,,SAINT PELUQUET,B041,81500,81213,Pratviel,81,,,81213000ZC0033,,,,,,,,,,,,,0,3,Dépendance,,0,T,terres,,,1200,1.881956,43.638074
2021-1379907,2021-02-03,000001,Vente,270000,5040,,SAINT PELUQUET,B041,81500,81213,Pratviel,81,,,81213000ZC0033,,,,,,,,,,,,,0,1,Maison,147,6,T,terres,,,1200,1.881956,43.638074
2021-1379907,2021-02-03,000001,Vente,270000,5040,,SAINT PELUQUET,B041,81500,81213,Pratviel,81,,,81213000ZC0033,,,,,,,,,,,,,0,3,Dépendance,,0,S,sols,,,800,1.881956,43.638074
2021-1381149,2021-04-02,000001,Vente,1600,,,SAINT PELUQUET,B041,81500,81213,Pratviel,81,,,81213000ZC0073,,,,,,,,,,,,,0,,,,,S,sols,,,738,1.883599,43.638018
2021-1383230,2021-06-18,000004,Echange,17007,,,PRATVIEL,B036,81500,81213,Pratviel,81,,,81213000ZC0059,,,,,,,,,,,,,0,,,,,L,landes,FRICH,Friche,1155,1.88509,43.638431
2021-1383230,2021-06-18,000004,Echange,17007,,,PRATVIEL,B036,81500,81213,Pratviel,81,,,81213000ZC0061,,,,,,,,,,,,,0,,,,,S,sols,,,803,1.884912,43.63821
2021-1383230,2021-06-18,000004,Echange,17007,,,PRATVIEL,B036,81500,81213,Pratviel,81,,,81213000ZC0064,,,,,,,,,,,,,0,,,,,S,sols,,,173,1.884475,43.63824
2021-1385285,2021-09-01,000001,Vente,21744,,,PRATVIEL,B036,81500,81213,Pratviel,81,,,81213000ZC0059,,,,,,,,,,,,,0,,,,,L,landes,FRICH,Friche,1155,1.88509,43.638431
2021-1385285,2021-09-01,000001,Vente,21744,,,PRATVIEL,B036,81500,81213,Pratviel,81,,,81213000ZC0061,,,,,,,,,,,,,0,,,,,S,sols,,,803,1.884912,43.63821
2021-1385285,2021-09-01,000001,Vente,21744,,,PRATVIEL,B036,81500,81213,Pratviel,81,,,81213000ZC0064,,,,,,,,,,,,,0,,,,,S,sols,,,173,1.884475,43.63824
2021-1388295,2021-12-01,000001,Echange,2000,,,BOIS DE LASTRUQUES,B004,81500,81213,Pratviel,81,,,812130000C0152,,,,,,,,,,,,,0,,,,,T,terres,,,3640,1.867272,43.635201
2021-1388295,2021-12-01,000002,Echange,2000,,,BOIS DE LASTRUQUES,B004,81500,81213,Pratviel,81,,,812130000C0156,,,,,,,,,,,,,0,,,,,T,terres,,,3600,1.86453,43.634765
