id_mutation,date_mutation,numero_disposition,nature_mutation,valeur_fonciere,adresse_numero,adresse_suffixe,adresse_nom_voie,adresse_code_voie,code_postal,code_commune,nom_commune,code_departement,ancien_code_commune,ancien_nom_commune,id_parcelle,ancien_id_parcelle,numero_volume,lot1_numero,lot1_surface_carrez,lot2_numero,lot2_surface_carrez,lot3_numero,lot3_surface_carrez,lot4_numero,lot4_surface_carrez,lot5_numero,lot5_surface_carrez,nombre_lots,code_type_local,type_local,surface_reelle_bati,nombre_pieces_principales,code_nature_culture,nature_culture,code_nature_culture_speciale,nature_culture_speciale,surface_terrain,longitude,latitude
2021-1381470,2021-04-15,000001,Vente,283150,1,,CHEM DU COURPOU,0002,81470,81229,Roquevidal,81,,,812290000A0470,,,,,,,,,,,,,0,1,Maison,175,4,S,sols,,,500,1.860965,43.625195
2021-1381470,2021-04-15,000001,Vente,283150,1,,CHEM DU COURPOU,0002,81470,81229,Roquevidal,81,,,812290000A0470,,,,,,,,,,,,,0,1,Maison,175,4,AG,terrains d'agrément,PARC,Parc,2000,1.860965,43.625195
2021-1382596,2021-06-04,000002,Vente,500,,,ROQUEVIDAL,B044,81470,81229,Roquevidal,81,,,812290000A0600,,,,,,,,,,,,,0,,,,,J,jardins,POTAG,Jardin potager,120,1.863678,43.625223
2021-1382596,2021-06-04,000002,Vente,500,,,ROQUEVIDAL,B044,81470,81229,Roquevidal,81,,,812290000A0601,,,,,,,,,,,,,0,,,,,J,jardins,POTAG,Jardin potager,40,1.863644,43.625363
2021-1382596,2021-06-04,000002,Vente,500,,,ROQUEVIDAL,B044,81470,81229,Roquevidal,81,,,812290000A0602,,,,,,,,,,,,,0,,,,,J,jardins,POTAG,Jardin potager,4,1.863687,43.625169
2021-1385910,2021-09-23,000001,Vente,271000,6,,CHEM DU MERIGOU,0004,81470,81229,Roquevidal,81,,,812290000A0226,,,,,,,,,,,,,0,3,Dépendance,,0,S,sols,,,435,1.864987,43.625615
2021-1385910,2021-09-23,000001,Vente,271000,6,,CHEM DU MERIGOU,0004,81470,81229,Roquevidal,81,,,812290000A0226,,,,,,,,,,,,,0,3,Dépendance,,0,S,sols,,,435,1.864987,43.625615
2021-1385910,2021-09-23,000001,Vente,271000,6,,CHEM DU MERIGOU,0004,81470,81229,Roquevidal,81,,,812290000A0226,,,,,,,,,,,,,0,1,Maison,150,5,S,sols,,,435,1.864987,43.625615
2021-1385910,2021-09-23,000001,Vente,271000,,,ROQUEVIDAL,B044,81470,81229,Roquevidal,81,,,812290000A0412,,,,,,,,,,,,,0,,,,,AG,terrains d'agrément,PARC,Parc,1265,1.864859,43.625507
2021-1385910,2021-09-23,000001,Vente,271000,,,ROQUEVIDAL,B044,81470,81229,Roquevidal,81,,,812290000A0412,,,,,,,,,,,,,0,,,,,S,sols,,,800,1.864859,43.625507
