id_mutation,date_mutation,numero_disposition,nature_mutation,valeur_fonciere,adresse_numero,adresse_suffixe,adresse_nom_voie,adresse_code_voie,code_postal,code_commune,nom_commune,code_departement,ancien_code_commune,ancien_nom_commune,id_parcelle,ancien_id_parcelle,numero_volume,lot1_numero,lot1_surface_carrez,lot2_numero,lot2_surface_carrez,lot3_numero,lot3_surface_carrez,lot4_numero,lot4_surface_carrez,lot5_numero,lot5_surface_carrez,nombre_lots,code_type_local,type_local,surface_reelle_bati,nombre_pieces_principales,code_nature_culture,nature_culture,code_nature_culture_speciale,nature_culture_speciale,surface_terrain,longitude,latitude
2021-1389179,2021-01-04,000001,Vente,22000,,,PLAINE DE LAVIT,B130,82120,82097,Lavit,82,,,820970000B1049,,,,,,,,,,,,,0,,,,,AB,terrains a bâtir,,,911,0.91941,43.963766
2021-1390922,2021-04-19,000001,Vente,154280,4,A,RUE DES BOURDETTES,0012,82120,82097,Lavit,82,,,820970000B0560,,,,,,,,,,,,,0,3,Dépendance,,0,J,jardins,POTAG,Jardin potager,235,0.922138,43.958057
2021-1390922,2021-04-19,000001,Vente,154280,,,VILLE,B157,82120,82097,Lavit,82,,,820970000B0561,,,,,,,,,,,,,0,,,,,S,sols,,,53,0.922161,43.958116
2021-1390922,2021-04-19,000001,Vente,154280,4,,RUE DES BOURDETTES,0012,82120,82097,Lavit,82,,,820970000B0562,,,,,,,,,,,,,0,1,Maison,120,4,S,sols,,,99,0.92224,43.958116
2021-1390922,2021-04-19,000001,Vente,154280,,,VILLE,B157,82120,82097,Lavit,82,,,820970000B0564,,,,,,,,,,,,,0,,,,,S,sols,,,95,0.922273,43.958153
2021-1390922,2021-04-19,000001,Vente,154280,,,VILLE,B157,82120,82097,Lavit,82,,,820970000B0804,,,,,,,,,,,,,0,,,,,J,jardins,POTAG,Jardin potager,413,0.922273,43.957967
2021-1390966,2021-04-20,000001,Vente,160000,26,,RUE DE LA REPUBLIQUE,0114,82120,82097,Lavit,82,,,820970000B0599,,,,,,,,,,,,,0,4,Local industriel. commercial ou assimilé,35,0,S,sols,,,212,0.920446,43.957257
2021-1390966,2021-04-20,000001,Vente,160000,26,,RUE DE LA REPUBLIQUE,0114,82120,82097,Lavit,82,,,820970000B0599,,,,,,,,,,,,,0,1,Maison,190,4,S,sols,,,212,0.920446,43.957257
2021-1390966,2021-04-20,000001,Vente,160000,26,,RUE DE LA REPUBLIQUE,0114,82120,82097,Lavit,82,,,820970000B0599,,,,,,,,,,,,,0,3,Dépendance,,0,S,sols,,,212,0.920446,43.957257
2021-1391695,2021-05-07,000001,Vente,136000,4,,RUE DE TOUMET,0125,82120,82097,Lavit,82,,,820970000B0308,,,,,,,,,,,,,0,1,Maison,86,5,S,sols,,,215,0.918934,43.957774
2021-1391695,2021-05-07,000001,Vente,136000,,,VILLE,B157,82120,82097,Lavit,82,,,820970000B0877,,,,,,,,,,,,,0,,,,,J,jardins,POTAG,Jardin potager,102,0.919036,43.957813
2021-1391716,2021-06-08,000001,Vente,194500,13,,CHE DE NEGRAU,0085,82120,82097,Lavit,82,,,820970000E0332,,,,,,,,,,,,,0,1,Maison,130,4,T,terres,,,1000,0.92459,43.953869
2021-1391716,2021-06-08,000001,Vente,194500,13,,CHE DE NEGRAU,0085,82120,82097,Lavit,82,,,820970000E0332,,,,,,,,,,,,,0,1,Maison,130,4,S,sols,,,502,0.92459,43.953869
2021-1392312,2021-07-01,000001,Vente,64000,14,,PL DE LA HALLE,0055,82120,82097,Lavit,82,,,820970000B0372,,,,,,,,,,,,,0,1,Maison,100,4,S,sols,,,68,0.919675,43.957295
2021-1392670,2021-07-08,000001,Vente,191150,27,,BD DES AMOUREUX,0005,82120,82097,Lavit,82,,,820970000B0621,,,,,,,,,,,,,0,1,Maison,38,1,S,sols,,,419,0.919915,43.956276
2021-1392670,2021-07-08,000001,Vente,191150,27,,BD DES AMOUREUX,0005,82120,82097,Lavit,82,,,820970000B0621,,,,,,,,,,,,,0,1,Maison,77,3,S,sols,,,419,0.919915,43.956276
2021-1392670,2021-07-08,000001,Vente,191150,27,,BD DES AMOUREUX,0005,82120,82097,Lavit,82,,,820970000B0621,,,,,,,,,,,,,0,4,Local industriel. commercial ou assimilé,16,0,S,sols,,,419,0.919915,43.956276
2021-1392941,2021-07-30,000001,Vente,274250,36,,RUE DE LA REPUBLIQUE,0114,82120,82097,Lavit,82,,,820970000B0786,,,,,,,,,,,,,0,1,Maison,420,8,S,sols,,,750,0.920795,43.957515
2021-1393096,2021-07-29,000001,Vente,18000,,,PLAINE DE LAVIT,B130,82120,82097,Lavit,82,,,820970000B0142,,,,,,,,,,,,,0,,,,,J,jardins,POTAG,Jardin potager,758,0.918853,43.960373
2021-1393096,2021-07-29,000001,Vente,18000,,,PLAINE DE LAVIT,B130,82120,82097,Lavit,82,,,820970000B0143,,,,,,,,,,,,,0,,,,,S,sols,,,13,0.919163,43.960506
2021-1393107,2021-07-19,000001,Vente,12500,,,BOUTEILLE,B028,82120,82097,Lavit,82,,,820970000B0037,,,,,,,,,,,,,0,,,,,T,terres,,,5191,0.94054,43.984545
2021-1393107,2021-07-19,000001,Vente,12500,,,BOUTEILLE,B028,82120,82097,Lavit,82,,,820970000B0037,,,,,,,,,,,,,0,,,,,BT,taillis simples,,,5000,0.94054,43.984545
2021-1393107,2021-07-19,000001,Vente,12500,,,BOUTEILLE,B028,82120,82097,Lavit,82,,,820970000B0943,,,,,,,,,,,,,0,,,,,P,prés,,,6780,0.94044,43.984888
2021-1393107,2021-07-19,000001,Vente,12500,,,BOUTEILLE,B028,82120,82097,Lavit,82,,,820970000B0990,,,,,,,,,,,,,0,,,,,T,terres,,,4265,0.938947,43.984457
2021-1393107,2021-07-19,000001,Vente,12500,,,BOUTEILLE,B028,82120,82097,Lavit,82,,,820970000B0992,,,,,,,,,,,,,0,,,,,BT,taillis simples,,,985,0.939371,43.984959
2021-1393163,2021-08-13,000001,Vente,216900,16,,LOT LE PARC DE LOMAGNE,A001,82120,82097,Lavit,82,,,820970000B1064,,,,,,,,,,,,,0,1,Maison,102,5,S,sols,,,759,0.922369,43.964315
2021-1393245,2021-08-19,000001,Vente,1000,,,LA BARAQUETTE,B009,82120,82097,Lavit,82,,,820970000G0191,,,,,,,,,,,,,0,,,,,BT,taillis simples,,,5077,0.920656,43.950017
2021-1393257,2021-07-22,000001,Vente,70000,5573,,PLAINE DE LAVIT,B130,82120,82097,Lavit,82,,,820970000B0123,,,,,,,,,,,,,0,3,Dépendance,,0,J,jardins,POTAG,Jardin potager,689,0.919001,43.959017
2021-1393257,2021-07-22,000001,Vente,70000,5573,,PLAINE DE LAVIT,B130,82120,82097,Lavit,82,,,820970000B0123,,,,,,,,,,,,,0,3,Dépendance,,0,S,sols,,,197,0.919001,43.959017
2021-1393591,2021-08-20,000001,Vente,211900,22,,LOT LE PARC DE LOMAGNE,A001,82120,82097,Lavit,82,,,820970000B1070,,,,,,,,,,,,,0,1,Maison,120,4,S,sols,,,821,0.92123,43.963977
2021-1393640,2021-08-24,000001,Vente,80000,27,,AV DE MANSONVILLE,0075,82120,82097,Lavit,82,,,820970000B0784,,,,,,,,,,,,,0,1,Maison,145,7,S,sols,,,549,0.917037,43.958049
2021-1393640,2021-08-24,000001,Vente,80000,,,VILLE,B157,82120,82097,Lavit,82,,,820970000B0977,,,,,,,,,,,,,0,,,,,P,prés,,,60,0.916904,43.958068
2021-1393641,2021-08-24,000001,Vente,20000,5222,,RUE DE LA GRAVETTE,0049,82120,82097,Lavit,82,,,820970000B0823,,,,,,,,,,,,,0,3,Dépendance,,0,S,sols,,,27,0.922981,43.958389
2021-1393641,2021-08-24,000001,Vente,20000,5503,,RUE DE LA GRAVETTE,0049,82120,82097,Lavit,82,,,820970000B0824,,,,,,,,,,,,,0,3,Dépendance,,0,S,sols,,,43,0.923024,43.958406
2021-1393850,2021-08-25,000001,Vente,169000,2,,AV DU STADE,0120,82120,82097,Lavit,82,,,820970000G0830,,,2,,,,,,,,,,1,3,Dépendance,,0,,,,,,0.920145,43.954027
2021-1393850,2021-08-25,000001,Vente,169000,2,,AV DU STADE,0120,82120,82097,Lavit,82,,,820970000G0830,,,1,,3,,,,,,,,2,2,Appartement,167,6,,,,,,0.920145,43.954027
2021-1393850,2021-08-25,000001,Vente,169000,2,,AV DU STADE,0120,82120,82097,Lavit,82,,,820970000G0830,,,4,,,,,,,,,,1,2,Appartement,53,4,,,,,,0.920145,43.954027
2021-1393850,2021-08-25,000001,Vente,169000,2,,AV DU STADE,0120,82120,82097,Lavit,82,,,820970000G0830,,,2,,,,,,,,,,1,3,Dépendance,,0,,,,,,0.920145,43.954027
2021-1393850,2021-08-25,000001,Vente,169000,2,,AV DU STADE,0120,82120,82097,Lavit,82,,,820970000G0830,,,1,,3,,,,,,,,2,3,Dépendance,,0,,,,,,0.920145,43.954027
2021-1393862,2021-09-06,000001,Vente,88000,87,,RUE DE LA REPUBLIQUE,0114,82120,82097,Lavit,82,,,820970000B0855,,,,,,,,,,,,,0,1,Maison,119,4,S,sols,,,285,0.923664,43.959698
2021-1393862,2021-09-06,000001,Vente,88000,87,,RUE DE LA REPUBLIQUE,0114,82120,82097,Lavit,82,,,820970000B0855,,,,,,,,,,,,,0,3,Dépendance,,0,S,sols,,,285,0.923664,43.959698
2021-1393889,2021-08-26,000001,Vente,143000,12,,BD DES AMOUREUX,0005,82120,82097,Lavit,82,,,820970000B1133,,,,,,,,,,,,,0,,,,,S,sols,,,89,0.91873,43.956333
2021-1393889,2021-08-26,000001,Vente,143000,,,,,,82097,Lavit,82,,,820970000B1134,,1,,,,,,,,,,,0,,,,,,,,,,0.918745,43.956295
2021-1393889,2021-08-26,000001,Vente,143000,,,RUE DE LA REPUBLIQUE,0114,82120,82097,Lavit,82,,,820970000B1134,,,,,,,,,,,,,0,,,,,S,sols,,,41,0.918745,43.956295
2021-1393889,2021-08-26,000001,Vente,143000,12,,RUE DE LA REPUBLIQUE,0114,82120,82097,Lavit,82,,,820970000B1136,,,,,,,,,,,,,0,,,,,S,sols,,,107,0.918841,43.95638
2021-1393889,2021-08-26,000001,Vente,143000,,,RUE DE LA REPUBLIQUE,0114,82120,82097,Lavit,82,,,820970000B1137,,,,,,,,,,,,,0,,,,,S,sols,,,37,0.918841,43.95632
2021-1394107,2021-09-17,000001,Vente,63100,22,,RUE DE LA REPUBLIQUE,0114,82120,82097,Lavit,82,,,820970000B0606,,,,,,,,,,,,,0,1,Maison,93,5,S,sols,,,198,0.919822,43.956858
2021-1394107,2021-09-17,000001,Vente,63100,22,,RUE DE LA REPUBLIQUE,0114,82120,82097,Lavit,82,,,820970000B0606,,,,,,,,,,,,,0,3,Dépendance,,0,S,sols,,,198,0.919822,43.956858
2021-1394107,2021-09-17,000001,Vente,63100,22,,RUE DE LA REPUBLIQUE,0114,82120,82097,Lavit,82,,,820970000B0606,,,,,,,,,,,,,0,3,Dépendance,,0,S,sols,,,198,0.919822,43.956858
2021-1394301,2021-09-28,000001,Vente,96400,9,,RTE DU CASTERON,0018,82120,82097,Lavit,82,,,820970000G0109,,,,,,,,,,,,,0,1,Maison,70,4,VI,vignes,,,913,0.912578,43.951729
2021-1394301,2021-09-28,000001,Vente,96400,9,,RTE DU CASTERON,0018,82120,82097,Lavit,82,,,820970000G0109,,,,,,,,,,,,,0,3,Dépendance,,0,VI,vignes,,,913,0.912578,43.951729
2021-1394301,2021-09-28,000001,Vente,96400,9,,RTE DU CASTERON,0018,82120,82097,Lavit,82,,,820970000G0109,,,,,,,,,,,,,0,3,Dépendance,,0,S,sols,,,294,0.912578,43.951729
2021-1394301,2021-09-28,000001,Vente,96400,9,,RTE DU CASTERON,0018,82120,82097,Lavit,82,,,820970000G0109,,,,,,,,,,,,,0,1,Maison,70,4,S,sols,,,294,0.912578,43.951729
2021-1394301,2021-09-28,000001,Vente,96400,9,,RTE DU CASTERON,0018,82120,82097,Lavit,82,,,820970000G0110,,,,,,,,,,,,,0,,,,,VI,vignes,,,973,0.912701,43.951802
2021-1394301,2021-09-28,000001,Vente,96400,9,,RTE DU CASTERON,0018,82120,82097,Lavit,82,,,820970000G0110,,,,,,,,,,,,,0,,,,,S,sols,,,294,0.912701,43.951802
2021-1394309,2021-09-28,000001,Vente,150000,11,,RTE D ASQUES,0007,82120,82097,Lavit,82,,,820970000B0181,,,,,,,,,,,,,0,1,Maison,97,4,T,terres,,,1167,0.9217,43.962718
2021-1394309,2021-09-28,000001,Vente,150000,11,,RTE D ASQUES,0007,82120,82097,Lavit,82,,,820970000B0181,,,,,,,,,,,,,0,1,Maison,97,4,S,sols,,,921,0.9217,43.962718
2021-1395269,2021-11-19,000001,Vente,216300,,,GUILHEMOUTON,B065,82120,82097,Lavit,82,,,820970000E0181,,,,,,,,,,,,,0,,,,,L,landes,FRICH,Friche,1745,0.927384,43.9539
2021-1395269,2021-11-19,000001,Vente,216300,18,,RTE DE GUILHEMOUTON,0051,82120,82097,Lavit,82,,,820970000E0339,,,,,,,,,,,,,0,1,Maison,137,5,T,terres,,,3300,0.926864,43.954192
2021-1395269,2021-11-19,000001,Vente,216300,18,,RTE DE GUILHEMOUTON,0051,82120,82097,Lavit,82,,,820970000E0339,,,,,,,,,,,,,0,3,Dépendance,,0,T,terres,,,3300,0.926864,43.954192
2021-1395269,2021-11-19,000001,Vente,216300,18,,RTE DE GUILHEMOUTON,0051,82120,82097,Lavit,82,,,820970000E0339,,,,,,,,,,,,,0,1,Maison,137,5,S,sols,,,572,0.926864,43.954192
2021-1395269,2021-11-19,000001,Vente,216300,18,,RTE DE GUILHEMOUTON,0051,82120,82097,Lavit,82,,,820970000E0339,,,,,,,,,,,,,0,3,Dépendance,,0,S,sols,,,572,0.926864,43.954192
2021-1395579,2021-11-29,000001,Vente,113000,92,B,RUE DE LA REPUBLIQUE,0114,82120,82097,Lavit,82,,,820970000B0707,,,,,,,,,,,,,0,1,Maison,84,3,S,sols,,,100,0.92443,43.95959
2021-1395734,2021-12-14,000001,Vente,127800,,,VILLE,B157,82120,82097,Lavit,82,,,820970000B0553,,,,,,,,,,,,,0,,,,,J,jardins,POTAG,Jardin potager,172,0.922697,43.957887
2021-1395734,2021-12-14,000001,Vente,127800,4,,RUE DE LA GRAVETTE,0049,82120,82097,Lavit,82,,,820970000B0554,,,,,,,,,,,,,0,1,Maison,86,4,S,sols,,,405,0.922572,43.957848
2021-1395734,2021-12-14,000001,Vente,127800,,,VILLE,B157,82120,82097,Lavit,82,,,820970000B0555,,,,,,,,,,,,,0,,,,,S,sols,,,40,0.922468,43.957875
2021-1396099,2021-12-13,000001,Vente,159000,5440,,BAUZELLE,B014,82120,82097,Lavit,82,,,820970000H0360,,,,,,,,,,,,,0,1,Maison,102,4,S,sols,,,1186,0.89121,43.946704
2021-1396116,2021-12-22,000001,Vente,60000,1,,AV DE MANSONVILLE,0075,82120,82097,Lavit,82,,,820970000B0249,,,,,,,,,,,,,0,1,Maison,150,5,S,sols,,,164,0.917472,43.95628
2021-1396272,2021-12-20,000001,Vente,111300,25,,BD DES AMOUREUX,0005,82120,82097,Lavit,82,,,820970000B0622,,,,,,,,,,,,,0,1,Maison,140,3,S,sols,,,183,0.919958,43.956368
