id_mutation,date_mutation,numero_disposition,nature_mutation,valeur_fonciere,adresse_numero,adresse_suffixe,adresse_nom_voie,adresse_code_voie,code_postal,code_commune,nom_commune,code_departement,ancien_code_commune,ancien_nom_commune,id_parcelle,ancien_id_parcelle,numero_volume,lot1_numero,lot1_surface_carrez,lot2_numero,lot2_surface_carrez,lot3_numero,lot3_surface_carrez,lot4_numero,lot4_surface_carrez,lot5_numero,lot5_surface_carrez,nombre_lots,code_type_local,type_local,surface_reelle_bati,nombre_pieces_principales,code_nature_culture,nature_culture,code_nature_culture_speciale,nature_culture_speciale,surface_terrain,longitude,latitude
2021-1389231,2021-01-22,000001,Vente,1000,,,CHEVALIER,B065,82440,82110,Mirabel,82,,,82110000BC0049,,,,,,,,,,,,,0,,,,,BT,taillis simples,,,1152,1.389637,44.152642
2021-1389231,2021-01-22,000001,Vente,1000,,,CHEVALIER,B065,82440,82110,Mirabel,82,,,82110000BC0052,,,,,,,,,,,,,0,,,,,BT,taillis simples,,,5517,1.389808,44.151924
2021-1389231,2021-01-22,000001,Vente,1000,,,GUIRALET,B125,82440,82110,Mirabel,82,,,82110000BC0080,,,,,,,,,,,,,0,,,,,BT,taillis simples,,,2607,1.393116,44.150503
2021-1389414,2021-01-07,000001,Vente,132500,,,QUATRE-ARPES,B200,82440,82110,Mirabel,82,,,82110000AN0166,,,,,,,,,,,,,0,,,,,T,terres,,,1877,1.429746,44.130938
2021-1389414,2021-01-07,000001,Vente,132500,,,QUATRE-ARPES,B200,82440,82110,Mirabel,82,,,82110000AN0167,,,,,,,,,,,,,0,,,,,T,terres,,,1624,1.430045,44.130968
2021-1389414,2021-01-07,000001,Vente,132500,1790,,RTE D ALBIAS,0031,82440,82110,Mirabel,82,,,82110000AN0171,,,,,,,,,,,,,0,1,Maison,85,4,S,sols,,,5100,1.430896,44.130863
2021-1389414,2021-01-07,000001,Vente,132500,,,QUATRE-ARPES,B200,82440,82110,Mirabel,82,,,82110000AN0174,,,,,,,,,,,,,0,,,,,P,prés,,,21970,1.431529,44.130473
2021-1389416,2021-02-04,000001,Vente,30000,,,REBESSENS DE CABILLOU,B210,82440,82110,Mirabel,82,,,82110000BE0060,,,,,,,,,,,,,0,,,,,T,terres,,,3444,1.412499,44.150095
2021-1389564,2021-01-19,000001,Vente,20000,5121,B,LE VILLAGE,B253,82440,82110,Mirabel,82,,,82110000AK0142,,,,,,,,,,,,,0,3,Dépendance,,0,S,sols,,,343,1.420516,44.141951
2021-1389564,2021-01-19,000001,Vente,20000,,,LE VILLAGE,B253,82440,82110,Mirabel,82,,,82110000AK0148,,,,,,,,,,,,,0,,,,,S,sols,,,27,1.420272,44.142018
2021-1389672,2021-02-03,000001,Vente,22000,,,LAGARDE-DIEU,B141,82440,82110,Mirabel,82,,,82110000AC0031,,,,,,,,,,,,,0,,,,,T,terres,,,4897,1.415959,44.169333
2021-1389672,2021-02-03,000001,Vente,22000,,,LAGARDE-DIEU,B141,82440,82110,Mirabel,82,,,82110000AC0032,,,,,,,,,,,,,0,,,,,T,terres,,,4609,1.414353,44.168874
2021-1389672,2021-02-03,000001,Vente,22000,,,LAGARDE-DIEU,B141,82440,82110,Mirabel,82,,,82110000AC0033,,,,,,,,,,,,,0,,,,,T,terres,,,1059,1.415263,44.168299
2021-1389672,2021-02-03,000001,Vente,22000,,,LAGARDE-DIEU,B141,82440,82110,Mirabel,82,,,82110000AC0034,,,,,,,,,,,,,0,,,,,T,terres,,,1471,1.415097,44.168281
2021-1389672,2021-02-03,000001,Vente,22000,,,LAGARDE-DIEU,B141,82440,82110,Mirabel,82,,,82110000AC0044,,,,,,,,,,,,,0,,,,,T,terres,,,841,1.416144,44.169179
2021-1389672,2021-02-03,000001,Vente,22000,,,LAGARDE-DIEU,B141,82440,82110,Mirabel,82,,,82110000AC0044,,,,,,,,,,,,,0,,,,,BT,taillis simples,,,6538,1.416144,44.169179
2021-1389672,2021-02-03,000001,Vente,22000,,,LAGARDE-DIEU,B141,82440,82110,Mirabel,82,,,82110000AC0044,,,,,,,,,,,,,0,,,,,T,terres,,,269,1.416144,44.169179
2021-1389672,2021-02-03,000001,Vente,22000,,,LAGARDE-DIEU,B141,82440,82110,Mirabel,82,,,82110000AC0045,,,,,,,,,,,,,0,,,,,T,terres,,,1571,1.416926,44.169267
2021-1389672,2021-02-03,000001,Vente,22000,,,LAGARDE-DIEU,B141,82440,82110,Mirabel,82,,,82110000AC0194,,,,,,,,,,,,,0,,,,,B,bois,CHENE,Chênes,3049,1.415155,44.16806
2021-1389672,2021-02-03,000001,Vente,22000,,,LAGARDE-DIEU,B141,82440,82110,Mirabel,82,,,82110000AC0194,,,,,,,,,,,,,0,,,,,T,terres,,,12493,1.415155,44.16806
2021-1389672,2021-02-03,000001,Vente,22000,,,LAGARDE-DIEU,B141,82440,82110,Mirabel,82,,,82110000AC0196,,,,,,,,,,,,,0,,,,,B,bois,CHENE,Chênes,1888,1.415749,44.167689
2021-1389672,2021-02-03,000001,Vente,22000,,,LAGARDE-DIEU,B141,82440,82110,Mirabel,82,,,82110000AC0198,,,,,,,,,,,,,0,,,,,B,bois,CHENE,Chênes,12027,1.416462,44.168078
2021-1389672,2021-02-03,000001,Vente,22000,,,LAGARDE-DIEU,B141,82440,82110,Mirabel,82,,,82110000AC0199,,,,,,,,,,,,,0,,,,,B,bois,CHENE,Chênes,2308,1.416777,44.167522
2021-1390081,2021-02-15,000001,Vente,815,,,LIEURAL,B150,82440,82110,Mirabel,82,,,82110000BD0003,,,,,,,,,,,,,0,,,,,BT,taillis simples,,,2619,1.395274,44.150175
2021-1390141,2021-02-18,000001,Vente,2235,,,LIEURAL,B150,82440,82110,Mirabel,82,,,82110000BD0015,,,,,,,,,,,,,0,,,,,BT,taillis simples,,,2268,1.396789,44.149472
2021-1390141,2021-02-18,000001,Vente,2235,,,LABROUSSE,B137,82440,82110,Mirabel,82,,,82110000BE0246,,,,,,,,,,,,,0,,,,,BT,taillis simples,,,4924,1.399343,44.14949
2021-1390252,2021-03-15,000001,Vente,172000,,,FRANCE,B102,82440,82110,Mirabel,82,,,82110000AR0117,,,,,,,,,,,,,0,,,,,P,prés,,,9570,1.431169,44.109981
2021-1390252,2021-03-15,000001,Vente,172000,,,FRANCE,B102,82440,82110,Mirabel,82,,,82110000AR0118,,,,,,,,,,,,,0,,,,,AG,terrains d'agrément,,,2771,1.430965,44.109609
2021-1390252,2021-03-15,000001,Vente,172000,1868,,RTE DE COS,0080,82440,82110,Mirabel,82,,,82110000AR0119,,,,,,,,,,,,,0,1,Maison,130,4,S,sols,,,2820,1.431261,44.109081
2021-1390416,2021-03-16,000001,Vente,11000,,,PESSOLES,B182,82440,82110,Mirabel,82,,,82110000AM0277,,,,,,,,,,,,,0,,,,,BT,taillis simples,,,1141,1.443964,44.135529
2021-1390416,2021-03-16,000001,Vente,11000,,,PESSOLES,B182,82440,82110,Mirabel,82,,,82110000AM0294,,,,,,,,,,,,,0,,,,,BT,taillis simples,,,6250,1.444505,44.135208
2021-1390416,2021-03-16,000001,Vente,11000,,,SADOUL,B228,82440,82110,Mirabel,82,,,82110000AP0157,,,,,,,,,,,,,0,,,,,BT,taillis simples,,,4500,1.43931,44.112295
2021-1390416,2021-03-16,000001,Vente,11000,,,ROC ESQUEJOULS,B222,82440,82110,Mirabel,82,,,82110000AR0088,,,,,,,,,,,,,0,,,,,BT,taillis simples,,,2398,1.438964,44.111936
2021-1390442,2021-02-09,000002,Vente,85000,,,RAUZAS,B206,82440,82110,Mirabel,82,,,82110000AE0080,,,,,,,,,,,,,0,,,,,T,terres,,,9720,1.434213,44.158819
2021-1390442,2021-02-09,000002,Vente,85000,,,RAUZAS,B206,82440,82110,Mirabel,82,,,82110000AE0081,,,,,,,,,,,,,0,,,,,T,terres,,,3990,1.434162,44.158606
2021-1390442,2021-02-09,000002,Vente,85000,,,RAUZAS,B206,82440,82110,Mirabel,82,,,82110000AE0082,,,,,,,,,,,,,0,,,,,T,terres,,,5659,1.434243,44.158097
2021-1390442,2021-02-09,000002,Vente,85000,,,RAUZAS,B206,82440,82110,Mirabel,82,,,82110000AE0083,,,,,,,,,,,,,0,,,,,T,terres,,,960,1.43402,44.157911
2021-1390442,2021-02-09,000002,Vente,85000,,,RAUZAS,B206,82440,82110,Mirabel,82,,,82110000AE0084,,,,,,,,,,,,,0,,,,,T,terres,,,1805,1.434818,44.157642
2021-1390442,2021-02-09,000002,Vente,85000,,,RAUZAS,B206,82440,82110,Mirabel,82,,,82110000AE0085,,,,,,,,,,,,,0,,,,,T,terres,,,4560,1.435369,44.157758
2021-1390442,2021-02-09,000002,Vente,85000,,,RAUZAS,B206,82440,82110,Mirabel,82,,,82110000AE0086,,,,,,,,,,,,,0,,,,,S,sols,,,500,1.436111,44.157168
2021-1390442,2021-02-09,000002,Vente,85000,,,RAUZAS,B206,82440,82110,Mirabel,82,,,82110000AE0086,,,,,,,,,,,,,0,,,,,T,terres,,,1270,1.436111,44.157168
2021-1390442,2021-02-09,000002,Vente,85000,,,RAUZAS,B206,82440,82110,Mirabel,82,,,82110000AE0087,,,,,,,,,,,,,0,,,,,T,terres,,,3950,1.435819,44.156981
2021-1390442,2021-02-09,000002,Vente,85000,,,RAUZAS,B206,82440,82110,Mirabel,82,,,82110000AE0088,,,,,,,,,,,,,0,,,,,T,terres,,,5980,1.437381,44.155662
2021-1390442,2021-02-09,000002,Vente,85000,,,RAUZAS,B206,82440,82110,Mirabel,82,,,82110000AE0089,,,,,,,,,,,,,0,,,,,P,prés,,,8950,1.433595,44.155975
2021-1390442,2021-02-09,000002,Vente,85000,,,RAUZAS,B206,82440,82110,Mirabel,82,,,82110000AE0090,,,,,,,,,,,,,0,,,,,T,terres,,,64180,1.434217,44.15721
2021-1390442,2021-02-09,000002,Vente,85000,,,RAUZAS,B206,82440,82110,Mirabel,82,,,82110000AE0091,,,,,,,,,,,,,0,,,,,T,terres,,,6625,1.432253,44.158457
2021-1390442,2021-02-09,000002,Vente,85000,,,BOIS DE POUMAREL,B028,82440,82110,Mirabel,82,,,82110000AE0117,,,,,,,,,,,,,0,,,,,BT,taillis simples,,,10830,1.432652,44.155546
2021-1390442,2021-02-09,000002,Vente,85000,,,POUMAREL,B193,82440,82110,Mirabel,82,,,82110000AH0066,,,,,,,,,,,,,0,,,,,T,terres,,,2703,1.433826,44.154969
2021-1390442,2021-02-09,000002,Vente,85000,,,POUMAREL,B193,82440,82110,Mirabel,82,,,82110000AH0067,,,,,,,,,,,,,0,,,,,T,terres,,,8180,1.434174,44.155663
2021-1390442,2021-02-09,000002,Vente,85000,,,NINI,B166,82440,82110,Mirabel,82,,,82110000AH0074,,,,,,,,,,,,,0,,,,,T,terres,,,11270,1.439263,44.154595
2021-1390442,2021-02-09,000002,Vente,85000,,,NINI,B166,82440,82110,Mirabel,82,,,82110000AH0104,,,,,,,,,,,,,0,,,,,BT,taillis simples,,,166,1.4342,44.152507
2021-1390442,2021-02-09,000002,Vente,85000,,,NINI,B166,82440,82110,Mirabel,82,,,82110000AH0105,,,,,,,,,,,,,0,,,,,VE,vergers,PRUNE,Pruniers,1220,1.433588,44.152757
2021-1390442,2021-02-09,000002,Vente,85000,,,NINI,B166,82440,82110,Mirabel,82,,,82110000AH0106,,,,,,,,,,,,,0,,,,,VE,vergers,PRUNE,Pruniers,902,1.433602,44.152585
2021-1390442,2021-02-09,000002,Vente,85000,,,NINI,B166,82440,82110,Mirabel,82,,,82110000AH0107,,,,,,,,,,,,,0,,,,,P,prés,,,1150,1.433523,44.152375
2021-1390442,2021-02-09,000002,Vente,85000,,,NINI,B166,82440,82110,Mirabel,82,,,82110000AH0107,,,,,,,,,,,,,0,,,,,BT,taillis simples,,,3010,1.433523,44.152375
2021-1390442,2021-02-09,000002,Vente,85000,,,NINI,B166,82440,82110,Mirabel,82,,,82110000AH0108,,,,,,,,,,,,,0,,,,,VE,vergers,PRUNE,Pruniers,5767,1.432884,44.15202
2021-1390442,2021-02-09,000002,Vente,85000,,,NINI,B166,82440,82110,Mirabel,82,,,82110000AH0108,,,,,,,,,,,,,0,,,,,P,prés,,,2193,1.432884,44.15202
2021-1390442,2021-02-09,000002,Vente,85000,,,REQUETCH,B215,82440,82110,Mirabel,82,,,82110000AH0128,,,,,,,,,,,,,0,,,,,T,terres,,,3610,1.44023,44.153982
2021-1390442,2021-02-09,000002,Vente,85000,,,REQUETCH,B215,82440,82110,Mirabel,82,,,82110000AH0129,,,,,,,,,,,,,0,,,,,P,prés,,,2465,1.440241,44.153507
2021-1390442,2021-02-09,000002,Vente,85000,,,REQUETCH,B215,82440,82110,Mirabel,82,,,82110000AH0130,,,,,,,,,,,,,0,,,,,L,landes,PATUR,Pâture plantée,1960,1.440826,44.153507
2021-1390442,2021-02-09,000002,Vente,85000,,,REQUETCH,B215,82440,82110,Mirabel,82,,,82110000AH0305,,,,,,,,,,,,,0,,,,,P,prés,,,10524,1.441196,44.152593
2021-1390442,2021-02-09,000002,Vente,85000,,,POUMAREL,B193,82440,82110,Mirabel,82,,,82110000AH0390,,,,,,,,,,,,,0,,,,,P,prés,,,9219,1.433509,44.155061
2021-1390442,2021-02-09,000002,Vente,85000,,,POUMAREL,B193,82440,82110,Mirabel,82,,,82110000AH0393,,,,,,,,,,,,,0,,,,,BT,taillis simples,,,632,1.434479,44.154871
2021-1390774,2021-04-20,000001,Vente,3103,,,LARRIEU,B143,82440,82110,Mirabel,82,,,82110000AY0118,,,,,,,,,,,,,0,,,,,BT,taillis simples,,,686,1.386631,44.135703
2021-1390774,2021-04-20,000001,Vente,3103,,,LARRIEU,B143,82440,82110,Mirabel,82,,,82110000AY0119,,,,,,,,,,,,,0,,,,,T,terres,,,1438,1.386767,44.135353
2021-1390774,2021-04-20,000001,Vente,3103,,,LARRIEU,B143,82440,82110,Mirabel,82,,,82110000AY0120,,,,,,,,,,,,,0,,,,,T,terres,,,6060,1.387142,44.134825
2021-1390774,2021-04-20,000001,Vente,3103,,,ROUSSILLES,B224,82440,82110,Mirabel,82,,,82110000AY0368,,,,,,,,,,,,,0,,,,,T,terres,,,477,1.387162,44.13387
2021-1390774,2021-04-20,000001,Vente,3103,,,ROUSSILLES,B224,82440,82110,Mirabel,82,,,82110000AY0370,,,,,,,,,,,,,0,,,,,P,prés,,,205,1.387044,44.134171
2021-1391498,2021-05-21,000002,Vente,40000,,,CRABIERE,B087,82440,82110,Mirabel,82,,,82110000BE0398,,,,,,,,,,,,,0,,,,,AB,terrains a bâtir,,,2000,1.411538,44.144048
2021-1391700,2021-06-04,000001,Vente,280000,758,,RTE DE SAINT BARTHELEMY,0550,82440,82110,Mirabel,82,,,82110000BE0230,,,,,,,,,,,,,0,1,Maison,100,3,S,sols,,,4420,1.400644,44.147197
2021-1391700,2021-06-04,000001,Vente,280000,,,HINEL,B129,82440,82110,Mirabel,82,,,82110000BE0231,,,,,,,,,,,,,0,,,,,P,prés,,,3750,1.400162,44.146804
2021-1391700,2021-06-04,000001,Vente,280000,,,HINEL,B129,82440,82110,Mirabel,82,,,82110000BE0233,,,,,,,,,,,,,0,,,,,BT,taillis simples,,,14520,1.400251,44.148302
2021-1391700,2021-06-04,000001,Vente,280000,,,HINEL,B129,82440,82110,Mirabel,82,,,82110000BE0313,,,,,,,,,,,,,0,,,,,P,prés,,,4081,1.399711,44.147348
2021-1391700,2021-06-04,000001,Vente,280000,,,BOIS DE PHILIPPET,B027,82440,82110,Mirabel,82,,,82110000BI0202,,,,,,,,,,,,,0,,,,,BT,taillis simples,,,4763,1.399871,44.154391
2021-1391700,2021-06-04,000001,Vente,280000,,,BOIS DE PHILIPPET,B027,82440,82110,Mirabel,82,,,82110000BI0203,,,,,,,,,,,,,0,,,,,BT,taillis simples,,,1599,1.399404,44.153977
2021-1391724,2021-05-20,000001,Vente,225000,,,TUC DE LAMOTHE,B249,82440,82110,Mirabel,82,,,82110000AM0345,,,,,,,,,,,,,0,,,,,T,terres,,,6895,,
2021-1391724,2021-05-20,000001,Vente,225000,,,TUC DE LAMOTHE,B249,82440,82110,Mirabel,82,,,82110000AM0345,,,,,,,,,,,,,0,,,,,S,sols,,,120,,
2021-1391724,2021-05-20,000001,Vente,225000,,,TUC DE LAMOTHE,B249,82440,82110,Mirabel,82,,,82110000AM0346,,,,,,,,,,,,,0,,,,,L,landes,PATUR,Pâture plantée,2,,
2021-1391724,2021-05-20,000001,Vente,225000,,,TUC DE LAMOTHE,B249,82440,82110,Mirabel,82,,,82110000AM0348,,,,,,,,,,,,,0,,,,,L,landes,PATUR,Pâture plantée,31,,
2021-1391724,2021-05-20,000001,Vente,225000,1465,,RTE D ALBIAS,0031,82440,82110,Mirabel,82,,,82110000AM0351,,,,,,,,,,,,,0,1,Maison,117,3,S,sols,,,1614,,
2021-1391724,2021-05-20,000001,Vente,225000,,,TUC DE LAMOTHE,B249,82440,82110,Mirabel,82,,,82110000AM0359,,,,,,,,,,,,,0,,,,,L,landes,PATUR,Pâture plantée,1016,,
2021-1391724,2021-05-20,000001,Vente,225000,,,SAULOS,B236,82440,82110,Mirabel,82,,,82110000AM0362,,,,,,,,,,,,,0,,,,,L,landes,PATUR,Pâture plantée,1803,,
2021-1391724,2021-05-20,000001,Vente,225000,,,CONDOUMINES,B077,82440,82110,Mirabel,82,,,82110000AM0364,,,,,,,,,,,,,0,,,,,T,terres,,,4,,
2021-1391724,2021-05-20,000001,Vente,225000,,,CONDOUMINES,B077,82440,82110,Mirabel,82,,,82110000AM0366,,,,,,,,,,,,,0,,,,,T,terres,,,698,,
2021-1391724,2021-05-20,000001,Vente,225000,,,CONDOUMINES,B077,82440,82110,Mirabel,82,,,82110000AM0368,,,,,,,,,,,,,0,,,,,L,landes,FRICH,Friche,93,,
2021-1391724,2021-05-20,000001,Vente,225000,,,CONDOUMINES,B077,82440,82110,Mirabel,82,,,82110000AM0369,,,,,,,,,,,,,0,,,,,L,landes,FRICH,Friche,1622,,
2021-1391724,2021-05-20,000001,Vente,225000,,,TUC DE LAMOTHE,B249,82440,82110,Mirabel,82,,,82110000AM0394,,,,,,,,,,,,,0,,,,,T,terres,,,23,,
2021-1391724,2021-05-20,000001,Vente,225000,,,TUC DE LAMOTHE,B249,82440,82110,Mirabel,82,,,82110000AM0395,,,,,,,,,,,,,0,,,,,T,terres,,,23,,
2021-1391724,2021-05-20,000001,Vente,225000,,,TUC DE LAMOTHE,B249,82440,82110,Mirabel,82,,,82110000AM0397,,,,,,,,,,,,,0,,,,,T,terres,,,19,,
2021-1391724,2021-05-20,000001,Vente,225000,,,TUC DE LAMOTHE,B249,82440,82110,Mirabel,82,,,82110000AM0399,,,,,,,,,,,,,0,,,,,T,terres,,,367,,
2021-1391724,2021-05-20,000001,Vente,225000,,,TUC DE LAMOTHE,B249,82440,82110,Mirabel,82,,,82110000AM0401,,,,,,,,,,,,,0,,,,,T,terres,,,1325,,
2021-1391724,2021-05-20,000001,Vente,225000,,,SAULOS,B236,82440,82110,Mirabel,82,,,82110000AM0403,,,,,,,,,,,,,0,,,,,T,terres,,,875,,
2021-1391724,2021-05-20,000001,Vente,225000,,,SAULOS,B236,82440,82110,Mirabel,82,,,82110000AM0405,,,,,,,,,,,,,0,,,,,T,terres,,,419,,
2021-1391724,2021-05-20,000001,Vente,225000,,,CONDOUMINES,B077,82440,82110,Mirabel,82,,,82110000AM0407,,,,,,,,,,,,,0,,,,,T,terres,,,152,,
2021-1391724,2021-05-20,000001,Vente,225000,,,CONDOUMINES,B077,82440,82110,Mirabel,82,,,82110000AM0409,,,,,,,,,,,,,0,,,,,T,terres,,,150,,
2021-1391818,2021-05-26,000001,Vente,1000,,,SOULELLIO DE REGNAC,B239,82440,82110,Mirabel,82,,,82110000AS0043,,,,,,,,,,,,,0,,,,,T,terres,,,2558,1.432185,44.121399
2021-1392362,2021-06-22,000002,Echange,1407.1,,,VIMINIES,B254,82440,82110,Mirabel,82,,,82110000BH0286,,,,,,,,,,,,,0,,,,,T,terres,,,923,1.417348,44.1545
2021-1392362,2021-06-22,000003,Echange,1407.1,,,VIMINIES,B254,82440,82110,Mirabel,82,,,82110000BH0307,,,,,,,,,,,,,0,,,,,P,prés,,,885,,
2021-1392362,2021-06-22,000003,Echange,1407.1,,,VIMINIES,B254,82440,82110,Mirabel,82,,,82110000BH0309,,,,,,,,,,,,,0,,,,,T,terres,,,38,,
2021-1392581,2021-06-30,000001,Vente,385000,,,CARRIERE,B055,82440,82110,Mirabel,82,,,82110000AZ0264,,,,,,,,,,,,,0,,,,,BT,taillis simples,,,19670,1.377591,44.149113
2021-1392581,2021-06-30,000001,Vente,385000,,,CARRIERE,B055,82440,82110,Mirabel,82,,,82110000AZ0269,,,,,,,,,,,,,0,,,,,BT,taillis simples,,,1319,1.374258,44.14908
2021-1392581,2021-06-30,000001,Vente,385000,2240,,RTE DE CARRIERE,0057,82440,82110,Mirabel,82,,,82110000AZ0287,,,,,,,,,,,,,0,3,Dépendance,,0,S,sols,,,4100,1.375309,44.148713
2021-1392581,2021-06-30,000001,Vente,385000,2240,,RTE DE CARRIERE,0057,82440,82110,Mirabel,82,,,82110000AZ0287,,,,,,,,,,,,,0,3,Dépendance,,0,S,sols,,,4100,1.375309,44.148713
2021-1392581,2021-06-30,000001,Vente,385000,2240,,RTE DE CARRIERE,0057,82440,82110,Mirabel,82,,,82110000AZ0287,,,,,,,,,,,,,0,3,Dépendance,,0,S,sols,,,4100,1.375309,44.148713
2021-1392581,2021-06-30,000001,Vente,385000,2240,,RTE DE CARRIERE,0057,82440,82110,Mirabel,82,,,82110000AZ0287,,,,,,,,,,,,,0,1,Maison,180,4,S,sols,,,4100,1.375309,44.148713
2021-1392581,2021-06-30,000001,Vente,385000,,,CARRIERE,B055,82440,82110,Mirabel,82,,,82110000AZ0289,,,,,,,,,,,,,0,,,,,T,terres,,,310,1.374671,44.148207
2021-1392581,2021-06-30,000001,Vente,385000,,,CARRIERE,B055,82440,82110,Mirabel,82,,,82110000AZ0291,,,,,,,,,,,,,0,,,,,T,terres,,,916,1.374511,44.14838
2021-1392581,2021-06-30,000001,Vente,385000,,,CARRIERE,B055,82440,82110,Mirabel,82,,,82110000AZ0294,,,,,,,,,,,,,0,,,,,P,prés,,,24975,1.375614,44.148713
2021-1392645,2021-07-02,000001,Vente,265500,,,CABROL,B047,82440,82110,Mirabel,82,,,82110000BD0438,,,,,,,,,,,,,0,,,,,T,terres,,,23,1.405464,44.142374
2021-1392645,2021-07-02,000001,Vente,265500,,,CABROL,B047,82440,82110,Mirabel,82,,,82110000BD0440,,,,,,,,,,,,,0,,,,,T,terres,,,229,1.405643,44.142479
2021-1392645,2021-07-02,000001,Vente,265500,73,,RTE DE SAINT BARTHELEMY,0550,82440,82110,Mirabel,82,,,82110000BD0442,,,,,,,,,,,,,0,3,Dépendance,,0,S,sols,,,522,1.405895,44.142488
2021-1392645,2021-07-02,000001,Vente,265500,73,,RTE DE SAINT BARTHELEMY,0550,82440,82110,Mirabel,82,,,82110000BD0442,,,,,,,,,,,,,0,1,Maison,127,3,S,sols,,,522,1.405895,44.142488
2021-1392645,2021-07-02,000001,Vente,265500,,,CABROL,B047,82440,82110,Mirabel,82,,,82110000BD0443,,,,,,,,,,,,,0,,,,,T,terres,,,1231,1.405774,44.142335
2021-1393536,2021-08-20,000001,Vente,160000,28,,CHE DES BARTHES,0034,82440,82110,Mirabel,82,,,82110000AH0259,,,,,,,,,,,,,0,1,Maison,88,4,S,sols,,,584,1.432093,44.140148
2021-1393536,2021-08-20,000001,Vente,160000,,,LE JUGE,B133,82440,82110,Mirabel,82,,,82110000AH0261,,,,,,,,,,,,,0,,,,,S,sols,,,53,1.43227,44.14022
2021-1393536,2021-08-20,000001,Vente,160000,,,LE JUGE,B133,82440,82110,Mirabel,82,,,82110000AH0303,,,,,,,,,,,,,0,,,,,T,terres,,,872,1.432034,44.140491
2021-1393677,2021-08-26,000001,Vente,138000,11,,RUE DE LA POSTE,0020,82440,82110,Mirabel,82,,,82110000AK0109,,,,,,,,,,,,,0,1,Maison,131,5,S,sols,,,133,1.421198,44.142679
2021-1394021,2021-09-22,000001,Vente,186000,10,,RUE DU CHATEAU,0068,82440,82110,Mirabel,82,,,82110000AK0082,,,,,,,,,,,,,0,1,Maison,95,4,S,sols,,,113,1.419666,44.143441
2021-1394244,2021-09-20,000001,Vente,119850,898,,RTE DE COUPY,0085,82440,82110,Mirabel,82,,,82110000AN0274,,,,,,,,,,,,,0,3,Dépendance,,0,S,sols,,,3763,1.42535,44.126553
2021-1394244,2021-09-20,000001,Vente,119850,898,,RTE DE COUPY,0085,82440,82110,Mirabel,82,,,82110000AN0274,,,,,,,,,,,,,0,1,Maison,80,3,S,sols,,,3763,1.42535,44.126553
2021-1394244,2021-09-20,000001,Vente,119850,898,,RTE DE COUPY,0085,82440,82110,Mirabel,82,,,82110000AN0274,,,,,,,,,,,,,0,3,Dépendance,,0,S,sols,,,3763,1.42535,44.126553
2021-1394244,2021-09-20,000001,Vente,119850,898,,RTE DE COUPY,0085,82440,82110,Mirabel,82,,,82110000AN0274,,,,,,,,,,,,,0,3,Dépendance,,0,S,sols,,,3763,1.42535,44.126553
2021-1394244,2021-09-20,000001,Vente,119850,,,COUPY,B082,82440,82110,Mirabel,82,,,82110000AN0401,,,,,,,,,,,,,0,,,,,L,landes,PATUR,Pâture plantée,3900,1.425042,44.126375
2021-1394256,2021-09-15,000002,Vente,60000,,,GAUCH-VIMINIES,B110,82440,82110,Mirabel,82,,,82110000AE0241,,,,,,,,,,,,,0,,,,,P,prés,,,2104,1.419903,44.15478
2021-1394256,2021-09-15,000002,Vente,60000,,,GAUCH-VIMINIES,B110,82440,82110,Mirabel,82,,,82110000AE0243,,,,,,,,,,,,,0,,,,,T,terres,,,306,1.420249,44.154592
2021-1394256,2021-09-15,000002,Vente,60000,,,GAUCH-VIMINIES,B110,82440,82110,Mirabel,82,,,82110000AE0245,,,,,,,,,,,,,0,,,,,S,sols,,,5145,1.420063,44.155063
2021-1394256,2021-09-15,000002,Vente,60000,,,GAUCH-VIMINIES,B110,82440,82110,Mirabel,82,,,82110000AE0247,,,,,,,,,,,,,0,,,,,L,landes,PATUR,Pâture plantée,3714,1.41878,44.155478
2021-1394896,2021-10-26,000001,Vente,1000,,,LIEURAL,B150,82440,82110,Mirabel,82,,,82110000BD0004,,,,,,,,,,,,,0,,,,,BT,taillis simples,,,1592,1.395465,44.149952
2021-1394896,2021-10-26,000001,Vente,1000,,,LIEURAL,B150,82440,82110,Mirabel,82,,,82110000BD0009,,,,,,,,,,,,,0,,,,,BT,taillis simples,,,2745,1.395706,44.149804
2021-1394896,2021-10-26,000001,Vente,1000,,,LIEURAL,B150,82440,82110,Mirabel,82,,,82110000BD0010,,,,,,,,,,,,,0,,,,,BT,taillis simples,,,3663,1.396316,44.149502
2021-1394896,2021-10-26,000001,Vente,1000,,,LUSCLADE-HAUTE,B154,82440,82110,Mirabel,82,,,82110000BI0141,,,,,,,,,,,,,0,,,,,BT,taillis simples,,,1142,1.399494,44.151727
2021-1395332,2021-11-25,000001,Vente,125000,17,,RUE DU CHATEAU,0068,82440,82110,Mirabel,82,,,82110000AK0152,,,,,,,,,,,,,0,1,Maison,45,2,S,sols,,,158,1.420152,44.142217
2021-1396142,2021-12-20,000002,Vente,200,,,LA VIOLE,B255,82440,82110,Mirabel,82,,,82110000AK0223,,,,,,,,,,,,,0,,,,,S,sols,,,40,1.419719,44.145575
2021-1396180,2021-12-22,000002,Vente,2200,,,LIEURAL,B150,82440,82110,Mirabel,82,,,82110000BD0463,,,,,,,,,,,,,0,,,,,P,prés,,,909,1.392243,44.148951
