id_mutation,date_mutation,numero_disposition,nature_mutation,valeur_fonciere,adresse_numero,adresse_suffixe,adresse_nom_voie,adresse_code_voie,code_postal,code_commune,nom_commune,code_departement,ancien_code_commune,ancien_nom_commune,id_parcelle,ancien_id_parcelle,numero_volume,lot1_numero,lot1_surface_carrez,lot2_numero,lot2_surface_carrez,lot3_numero,lot3_surface_carrez,lot4_numero,lot4_surface_carrez,lot5_numero,lot5_surface_carrez,nombre_lots,code_type_local,type_local,surface_reelle_bati,nombre_pieces_principales,code_nature_culture,nature_culture,code_nature_culture_speciale,nature_culture_speciale,surface_terrain,longitude,latitude
2021-1418064,2021-01-04,000001,Vente,197900,53,,AV DE MONTESARCHIO,2250,83130,83062,La Garde,83,,,83062000AI0580,,,112,,143,66.26,,,,,,,2,2,Appartement,63,3,,,,,,6.008732,43.127049
2021-1418103,2021-01-05,000001,Vente,177000,9001,,RES DU ROCHER,A558,83130,83062,La Garde,83,,,83062000AH0819,,,288,,324,75.14,,,,,,,2,2,Appartement,76,4,,,,,,6.014507,43.126809
2021-1418104,2021-01-07,000001,Vente,150000,9001,,RES L OREE DE LA GARDE,A518,83130,83062,La Garde,83,,,83062000AI0775,,,110,52.9,,,,,,,,,1,2,Appartement,53,2,,,,,,6.00066,43.124686
2021-1418123,2021-01-14,000001,Vente,579343,153,,IMP DE FORCALQUIER,1776,83130,83062,La Garde,83,,,83062000AB0381,,,,,,,,,,,,,0,3,Dépendance,,0,S,sols,,,1107,5.99523,43.126924
2021-1418123,2021-01-14,000001,Vente,579343,153,,IMP DE FORCALQUIER,1776,83130,83062,La Garde,83,,,83062000AB0381,,,,,,,,,,,,,0,1,Maison,127,7,S,sols,,,1107,5.99523,43.126924
2021-1418123,2021-01-14,000001,Vente,579343,153,,IMP DE FORCALQUIER,1776,83130,83062,La Garde,83,,,83062000AB0381,,,,,,,,,,,,,0,3,Dépendance,,0,S,sols,,,1107,5.99523,43.126924
2021-1418126,2021-01-11,000001,Vente,340000,17,,RES LHELIANTE,A456,83130,83062,La Garde,83,,,83062000AK0303,,,,,,,,,,,,,0,1,Maison,74,2,S,sols,,,349,6.013228,43.131154
2021-1418135,2021-01-08,000001,Vente,162000,175,,AV FREDERIC MISTRAL,1812,83130,83062,La Garde,83,,,83062000AE0858,,,18,,30,69.02,,,,,,,2,2,Appartement,68,4,,,,,,,
2021-1418135,2021-01-08,000001,Vente,162000,175,,AV FREDERIC MISTRAL,1812,83130,83062,La Garde,83,,,83062000AE0858,,,18,,30,69.02,,,,,,,2,3,Dépendance,,0,,,,,,,
2021-1418146,2021-01-06,000001,Vente en l'état futur d'achèvement,290500,,,LES SAVELS,B104,83130,83062,La Garde,83,,,83062000AT0005,,,107,,,,,,,,,,1,,,,,,,,,,6.00098,43.119296
2021-1418146,2021-01-06,000001,Vente en l'état futur d'achèvement,290500,,,LES SAVELS,B104,83130,83062,La Garde,83,,,83062000AT0005,,,5,,,,,,,,,,1,,,,,,,,,,6.00098,43.119296
2021-1418146,2021-01-06,000001,Vente en l'état futur d'achèvement,290500,,,LES SAVELS,B104,83130,83062,La Garde,83,,,83062000AT0005,,,110,,,,,,,,,,1,,,,,,,,,,6.00098,43.119296
2021-1418150,2021-01-07,000001,Vente,145000,1107,,AV DE LA PAIX,2331,83130,83062,La Garde,83,,,83062000AK0530,,,60,,,,,,,,,,1,3,Dépendance,,0,,,,,,6.012897,43.130114
2021-1418150,2021-01-07,000001,Vente,145000,1107,,AV DE LA PAIX,2331,83130,83062,La Garde,83,,,83062000AK0530,,,56,,,,,,,,,,1,3,Dépendance,,0,,,,,,6.012897,43.130114
2021-1418150,2021-01-07,000001,Vente,145000,1107,,AV DE LA PAIX,2331,83130,83062,La Garde,83,,,83062000AK0530,,,57,,,,,,,,,,1,3,Dépendance,,0,,,,,,6.012897,43.130114
2021-1418171,2021-01-20,000001,Vente en l'état futur d'achèvement,123900,,,RUE FLORA TRISTAN,1771,83130,83062,La Garde,83,,,83062000AN0493,,,8,,,,,,,,,,1,,,,,,,,,,6.015493,43.12913
2021-1418182,2021-01-06,000001,Vente,1,,,LES SAVELS,B104,83130,83062,La Garde,83,,,83062000AD0738,,,,,,,,,,,,,0,,,,,L,landes,,,20,6.001342,43.120852
2021-1418184,2021-01-06,000001,Vente en l'état futur d'achèvement,227000,,,SAINTE MARGUERITE,B100,83130,83062,La Garde,83,,,83062000AX0715,,,42,,,,,,,,,,1,,,,,,,,,,5.980877,43.11363
2021-1418184,2021-01-06,000001,Vente en l'état futur d'achèvement,227000,,,SAINTE MARGUERITE,B100,83130,83062,La Garde,83,,,83062000AX0715,,,22,,,,,,,,,,1,,,,,,,,,,5.980877,43.11363
2021-1418214,2021-01-20,000001,Vente en l'état futur d'achèvement,336800,,,REBLANCON,B092,83130,83062,La Garde,83,,,83062000AI1172,,,8,,,,,,,,,,1,,,,,,,,,,5.99718,43.128659
2021-1418225,2021-01-04,000001,Vente en l'état futur d'achèvement,226000,,,LE THOUAR,B108,83130,83062,La Garde,83,,,83062000AI0897,,,27,,,,,,,,,,1,,,,,,,,,,6.008431,43.127325
2021-1418225,2021-01-04,000001,Vente en l'état futur d'achèvement,226000,,,LE THOUAR,B108,83130,83062,La Garde,83,,,83062000AI0897,,,2,,,,,,,,,,1,,,,,,,,,,6.008431,43.127325
2021-1418225,2021-01-04,000001,Vente en l'état futur d'achèvement,226000,,,LE THOUAR,B108,83130,83062,La Garde,83,,,83062000AI0897,,,48,,,,,,,,,,1,,,,,,,,,,6.008431,43.127325
2021-1418230,2021-01-04,000001,Vente en l'état futur d'achèvement,115000,,,LE THOUAR,B108,83130,83062,La Garde,83,,,83062000AI0897,,,55,,,,,,,,,,1,,,,,,,,,,6.008431,43.127325
2021-1418230,2021-01-04,000001,Vente en l'état futur d'achèvement,115000,,,LE THOUAR,B108,83130,83062,La Garde,83,,,83062000AI0897,,,8,,,,,,,,,,1,,,,,,,,,,6.008431,43.127325
2021-1418247,2021-01-08,000001,Vente,229510,9001,,RES L OREE DE LA GARDE,A518,83130,83062,La Garde,83,,,83062000AI0755,,,33,84.71,79,,,,,,,,2,2,Appartement,84,4,,,,,,6.001269,43.125248
2021-1418247,2021-01-08,000001,Vente,229510,9001,,RES L OREE DE LA GARDE,A518,83130,83062,La Garde,83,,,83062000AI0755,,,33,84.71,79,,,,,,,,2,3,Dépendance,,0,,,,,,6.001269,43.125248
2021-1418247,2021-01-08,000001,Vente,229510,9001,,RES L OREE DE LA GARDE,A518,83130,83062,La Garde,83,,,83062000AI0755,,,33,84.71,79,,,,,,,,2,3,Dépendance,,0,,,,,,6.001269,43.125248
2021-1418247,2021-01-08,000001,Vente,229510,9001,,RES L OREE DE LA GARDE,A518,83130,83062,La Garde,83,,,83062000AI0775,,,84,,,,,,,,,,1,3,Dépendance,,0,,,,,,6.00066,43.124686
2021-1418249,2021-01-11,000001,Vente,150000,309,,AV DU HUIT MAI 1945,1921,83130,83062,La Garde,83,,,83062000AE0925,,,49,,53,6.05,,,,,,,2,2,Appartement,62,3,,,,,,6.005623,43.120715
2021-1418249,2021-01-11,000001,Vente,150000,309,,AV DU HUIT MAI 1945,1921,83130,83062,La Garde,83,,,83062000AE0925,,,49,,53,6.05,,,,,,,2,3,Dépendance,,0,,,,,,6.005623,43.120715
2021-1418257,2021-01-07,000001,Vente en l'état futur d'achèvement,295000,,,LE THOUAR,B108,83130,83062,La Garde,83,,,83062000AI0897,,,37,,,,,,,,,,1,,,,,,,,,,6.008431,43.127325
2021-1418257,2021-01-07,000001,Vente en l'état futur d'achèvement,295000,,,LE THOUAR,B108,83130,83062,La Garde,83,,,83062000AI0897,,,36,,,,,,,,,,1,,,,,,,,,,6.008431,43.127325
2021-1418257,2021-01-07,000001,Vente en l'état futur d'achèvement,295000,,,LE THOUAR,B108,83130,83062,La Garde,83,,,83062000AI0897,,,20,,,,,,,,,,1,,,,,,,,,,6.008431,43.127325
2021-1418266,2021-01-12,000001,Vente en l'état futur d'achèvement,209500,,,LES SAVELS,B104,83130,83062,La Garde,83,,,83062000AT0005,,,70,,,,,,,,,,1,,,,,,,,,,6.00098,43.119296
2021-1418266,2021-01-12,000001,Vente en l'état futur d'achèvement,209500,,,LES SAVELS,B104,83130,83062,La Garde,83,,,83062000AT0005,,,3,,,,,,,,,,1,,,,,,,,,,6.00098,43.119296
2021-1418266,2021-01-12,000001,Vente en l'état futur d'achèvement,209500,,,LES SAVELS,B104,83130,83062,La Garde,83,,,83062000AT0005,,,122,,,,,,,,,,1,,,,,,,,,,6.00098,43.119296
2021-1418283,2021-01-15,000001,Vente,72500,82,,CHE DE RABASSON,2483,83130,83062,La Garde,83,,,83062000AR0356,,,2,22.54,,,,,,,,,1,2,Appartement,22,1,,,,,,6.017135,43.125826
2021-1418283,2021-01-15,000001,Vente,72500,45,,LA BERGERIE,A336,83130,83062,La Garde,83,,,83062000AR0356,,,35,,,,,,,,,,1,3,Dépendance,,0,,,,,,6.017135,43.125826
2021-1418284,2021-01-15,000001,Vente,409950,933,,AV PREMIERE DFL,2468,83130,83062,La Garde,83,,,83062000AI1222,,,8,,,,,,,,,,1,3,Dépendance,,0,,,,,,5.999305,43.126008
2021-1418284,2021-01-15,000001,Vente,409950,933,,AV PREMIERE DFL,2468,83130,83062,La Garde,83,,,83062000AI1222,,,1,101.31,,,,,,,,,1,2,Appartement,101,4,,,,,,5.999305,43.126008
2021-1418284,2021-01-15,000001,Vente,409950,933,,AV PREMIERE DFL,2468,83130,83062,La Garde,83,,,83062000AI1222,,,9,,,,,,,,,,1,3,Dépendance,,0,,,,,,5.999305,43.126008
2021-1418290,2021-01-20,000001,Vente,409000,30,,IMP DES ALPILLES,1370,83130,83062,La Garde,83,,,83062000AC0412,,,,,,,,,,,,,0,1,Maison,115,5,S,sols,,,575,5.990647,43.115088
2021-1418311,2021-01-26,000001,Vente,436000,39,,RUE GASPARD DE BESSE,1848,83130,83062,La Garde,83,,,83062000AV0287,,,,,,,,,,,,,0,1,Maison,95,6,S,sols,,,449,5.99731,43.109466
2021-1418325,2021-01-14,000001,Vente,158000,452,,CHE DE RABASSON,2483,83130,83062,La Garde,83,,,83062000AR0241,,,57,,64,67.45,,,,,,,2,2,Appartement,68,3,,,,,,6.021455,43.126968
2021-1418325,2021-01-14,000001,Vente,158000,452,,CHE DE RABASSON,2483,83130,83062,La Garde,83,,,83062000AR0241,,,111,,,,,,,,,,1,3,Dépendance,,0,,,,,,6.021455,43.126968
2021-1418344,2021-01-28,000001,Vente en l'état futur d'achèvement,151192,,,RUE FLORA TRISTAN,1771,83130,83062,La Garde,83,,,83062000AN0493,,,18,,,,,,,,,,1,,,,,,,,,,6.015493,43.12913
2021-1418344,2021-01-28,000001,Vente en l'état futur d'achèvement,151192,9005,,AV 1ER BIM DU PACIFIQUE,1479,83130,83062,La Garde,83,,,83062000AN1637,,,2,,,,,,,,,,1,,,,,,,,,,6.014911,43.12969
2021-1418346,2021-01-22,000002,Vente,1000,,,ALL DE LA COLOMBIE,0383,83130,83062,La Garde,83,,,83062000AV0699,,,,,,,,,,,,,0,,,,,L,landes,,,11,5.995557,43.11242
2021-1418365,2021-01-11,000001,Vente,338500,77,,RUE PAOLO SOULET,2351,83130,83062,La Garde,83,,,83062000AV0300,,,,,,,,,,,,,0,1,Maison,77,4,S,sols,,,324,5.997663,43.109589
2021-1418436,2021-01-21,000001,Vente,18500,70,,RUE MARC DELAGE,2168,83130,83062,La Garde,83,,,83062000AI0939,,,22,,,,,,,,,,1,3,Dépendance,,0,,,,,,6.008024,43.125516
2021-1418439,2021-01-14,000001,Vente,320000,93,,CHE MARCEL PAGNOL,2173,83130,83062,La Garde,83,,,83062000AB1237,,,,,,,,,,,,,0,1,Maison,35,1,S,sols,,,463,,
2021-1418439,2021-01-14,000001,Vente,320000,93,,CHE MARCEL PAGNOL,2173,83130,83062,La Garde,83,,,83062000AB1237,,,,,,,,,,,,,0,1,Maison,100,5,S,sols,,,463,,
2021-1418439,2021-01-14,000001,Vente,320000,93,,CHE MARCEL PAGNOL,2173,83130,83062,La Garde,83,,,83062000AB1242,,,,,,,,,,,,,0,,,,,S,sols,,,195,5.992705,43.121476
2021-1418451,2021-01-25,000001,Vente,19000,70,,RUE MARC DELAGE,2168,83130,83062,La Garde,83,,,83062000AI0939,,,215,,,,,,,,,,1,3,Dépendance,,0,,,,,,6.008024,43.125516
2021-1418487,2021-01-13,000001,Vente en l'état futur d'achèvement,209000,,,LE THOUAR,B108,83130,83062,La Garde,83,,,83062000AI0897,,,46,,,,,,,,,,1,,,,,,,,,,6.008431,43.127325
2021-1418487,2021-01-13,000001,Vente en l'état futur d'achèvement,209000,,,LE THOUAR,B108,83130,83062,La Garde,83,,,83062000AI0897,,,9,,,,,,,,,,1,,,,,,,,,,6.008431,43.127325
2021-1418501,2021-02-05,000001,Vente,172000,,,LE TRANIER,A513,83130,83062,La Garde,83,,,83062000AE0261,,,22,60.52,,,,,,,,,1,2,Appartement,56,4,,,,,,6.005131,43.123135
2021-1418527,2021-01-12,000001,Vente,139000,93,,CHE MARCEL PAGNOL,2173,83130,83062,La Garde,83,,,83062000AB1241,,,,,,,,,,,,,0,,,,,S,sols,,,149,5.992593,43.121968
2021-1418571,2021-01-19,000001,Vente,315000,142,,AV PAUL CEZANNE,2362,83130,83062,La Garde,83,,,83062000AN0765,,,,,,,,,,,,,0,1,Maison,108,5,S,sols,,,253,6.017476,43.127441
2021-1418590,2021-01-27,000001,Vente,135000,,,L'OLIVINE,A517,83130,83062,La Garde,83,,,83062000AE0953,,,86,65.35,,,,,,,,,1,4,Local industriel. commercial ou assimilé,66,0,,,,,,6.002222,43.122851
2021-1418615,2021-02-09,000001,Vente,233650,5001,F,RUE MARC CHAGALL,1554,83130,83062,La Garde,83,,,83062000AN1327,,,56,,69,,,,,,,,2,2,Appartement,68,3,,,,,,6.020169,43.131599
2021-1418615,2021-02-09,000001,Vente,233650,5001,F,RUE MARC CHAGALL,1554,83130,83062,La Garde,83,,,83062000AN1327,,,97,,,,,,,,,,1,3,Dépendance,,0,,,,,,6.020169,43.131599
2021-1418619,2021-01-28,000001,Vente,420000,22,,IMP DE NAVARRE,2280,83130,83062,La Garde,83,,,83062000AW0159,,,,,,,,,,,,,0,4,Local industriel. commercial ou assimilé,,0,S,sols,,,728,5.988906,43.10812
2021-1418619,2021-01-28,000001,Vente,420000,22,,IMP DE NAVARRE,2280,83130,83062,La Garde,83,,,83062000AW0159,,,,,,,,,,,,,0,1,Maison,140,5,S,sols,,,728,5.988906,43.10812
2021-1418626,2021-01-15,000001,Vente,181000,645,,CHE DE SAINTE MUSSE,2587,83130,83062,La Garde,83,,,83062000AB1159,,,,,,,,,,,,,0,,,,,AB,terrains a bâtir,,,418,5.991909,43.122047
2021-1418640,2021-01-29,000001,Vente,200000,303,,RUE MARC DELAGE,2168,83130,83062,La Garde,83,,,83062000AE0943,,,203,83.16,,,,,,,,,1,2,Appartement,81,4,,,,,,6.005584,43.124465
2021-1418640,2021-01-29,000001,Vente,200000,303,,RUE MARC DELAGE,2168,83130,83062,La Garde,83,,,83062000AE0943,,,267,,,,,,,,,,1,3,Dépendance,,0,,,,,,6.005584,43.124465
2021-1418651,2021-01-22,000001,Vente,115000,99,,AV BAPTISTIN AUTRAN,1457,83130,83062,La Garde,83,,,83062000AH0843,,,27,,4,35.86,,,,,,,2,2,Appartement,36,2,,,,,,6.011575,43.12609
2021-1418651,2021-01-22,000001,Vente,115000,99,,AV BAPTISTIN AUTRAN,1457,83130,83062,La Garde,83,,,83062000AH0843,,,27,,4,35.86,,,,,,,2,3,Dépendance,,0,,,,,,6.011575,43.12609
2021-1418665,2021-01-28,000001,Vente en l'état futur d'achèvement,193000,,,SAINTE MARGUERITE,B100,83130,83062,La Garde,83,,,83062000AX0715,,,1,,,,,,,,,,1,,,,,,,,,,5.980877,43.11363
2021-1418665,2021-01-28,000001,Vente en l'état futur d'achèvement,193000,,,SAINTE MARGUERITE,B100,83130,83062,La Garde,83,,,83062000AX0715,,,38,,,,,,,,,,1,,,,,,,,,,5.980877,43.11363
2021-1418691,2021-01-22,000001,Vente,140000,9001,,IMM LE PLEIN SOLEIL,A533,83130,83062,La Garde,83,,,83062000AE1123,,,34,60.73,,,,,,,,,1,2,Appartement,61,3,,,,,,,
2021-1418725,2021-02-04,000001,Vente,240000,,,COSTE BOYERE,B052,83130,83062,La Garde,83,,,83062000AK0529,,,,,,,,,,,,,0,,,,,S,sols,,,175,6.011478,43.13426
2021-1418725,2021-02-04,000001,Vente,240000,140,,CHE DE LA GARRIGUE,1846,83130,83062,La Garde,83,,,83062000AK0606,,,,,,,,,,,,,0,,,,,AB,terrains a bâtir,,,706,6.011416,43.133826
2021-1418725,2021-02-04,000001,Vente,240000,140,,CHE DE LA GARRIGUE,1846,83130,83062,La Garde,83,,,83062000AK0607,,,,,,,,,,,,,0,,,,,L,landes,,,453,6.011705,43.134049
2021-1418754,2021-01-29,000001,Vente,20000,1107,,AV DE LA PAIX,2331,83130,83062,La Garde,83,,,83062000AK0530,,,77,,,,,,,,,,1,3,Dépendance,,0,,,,,,6.012897,43.130114
2021-1418762,2021-02-11,000001,Vente,164000,70,,RUE MARC DELAGE,2168,83130,83062,La Garde,83,,,83062000AI0939,,,67,,76,65.25,,,,,,,2,2,Appartement,63,4,,,,,,6.008024,43.125516
2021-1418774,2021-01-25,000001,Vente,352000,156,,RUE DE LA TRELUZIERE,2653,83130,83062,La Garde,83,,,83062000AC0499,,,,,,,,,,,,,0,1,Maison,95,4,S,sols,,,740,5.984491,43.117161
2021-1418781,2021-01-29,000001,Vente,240636,223,,RUE LE CORBUSIER,2048,83130,83062,La Garde,83,,,83062000AN1588,,,130,62.53,,,,,,,,,1,2,Appartement,62,3,,,,,,6.020436,43.133932
2021-1418781,2021-01-29,000001,Vente,240636,223,,RUE LE CORBUSIER,2048,83130,83062,La Garde,83,,,83062000AN1588,,,151,,,,,,,,,,1,3,Dépendance,,0,,,,,,6.020436,43.133932
2021-1418781,2021-01-29,000001,Vente,240636,223,,RUE LE CORBUSIER,2048,83130,83062,La Garde,83,,,83062000AN1588,,,107,,,,,,,,,,1,3,Dépendance,,0,,,,,,6.020436,43.133932
2021-1418793,2021-02-04,000001,Vente,291900,,,LE GRAND PAVOIS,A427,83130,83062,La Garde,83,,,83062000AH0475,,,3,,,,,,,,,,1,3,Dépendance,,0,,,,,,6.013117,43.127434
2021-1418793,2021-02-04,000001,Vente,291900,90,,ALL ARISTIDE MAILLOL,1420,83130,83062,La Garde,83,,,83062000AH0475,,,74,65.33,,,,,,,,,1,2,Appartement,67,3,,,,,,6.013117,43.127434
2021-1418793,2021-02-04,000001,Vente,291900,,,LE GRAND PAVOIS,A427,83130,83062,La Garde,83,,,83062000AH0475,,,26,,,,,,,,,,1,3,Dépendance,,0,,,,,,6.013117,43.127434
2021-1418793,2021-02-04,000001,Vente,291900,,,LE GRAND PAVOIS,A427,83130,83062,La Garde,83,,,83062000AH0475,,,27,,,,,,,,,,1,3,Dépendance,,0,,,,,,6.013117,43.127434
2021-1418812,2021-02-09,000001,Vente,240000,121,,RUE MARC DELAGE,2168,83130,83062,La Garde,83,,,83062000AE0944,,,158,,22,109.01,,,,,,,2,2,Appartement,110,5,,,,,,6.007333,43.124596
2021-1418844,2021-02-02,000001,Vente en l'état futur d'achèvement,207000,,,,,,83062,La Garde,83,,,83062000AR0221,,,13,,,,,,,,,,1,,,,,,,,,,6.02111,43.127226
2021-1418844,2021-02-02,000001,Vente en l'état futur d'achèvement,207000,,,,,,83062,La Garde,83,,,83062000AR0221,,,49,,,,,,,,,,1,,,,,,,,,,6.02111,43.127226
2021-1418844,2021-02-02,000001,Vente en l'état futur d'achèvement,207000,,,,,,83062,La Garde,83,,,83062000AR0221,,,123,,,,,,,,,,1,,,,,,,,,,6.02111,43.127226
2021-1418877,2021-02-02,000001,Vente,412000,467,,AV ABEL GANCE,1330,83130,83062,La Garde,83,,,83062000AD0744,,,34,,,,,,,,,,1,1,Maison,108,4,,,,,,5.999943,43.120744
2021-1418906,2021-02-01,000001,Vente,140000,9001,,LES FLORALIES,A418,83130,83062,La Garde,83,,,83062000AI0739,,,216,,269,43.81,,,,,,,2,2,Appartement,44,2,,,,,,6.009053,43.126861
2021-1418906,2021-02-01,000001,Vente,140000,9001,,LES FLORALIES,A418,83130,83062,La Garde,83,,,83062000AI0739,,,216,,269,43.81,,,,,,,2,3,Dépendance,,0,,,,,,6.009053,43.126861
2021-1418912,2021-02-18,000001,Vente,179500,334,,AV FREDERIC MISTRAL,1812,83130,83062,La Garde,83,,,83062000AE0949,,,5,,8,66.4,,,,,,,2,3,Dépendance,,0,,,,,,6.005934,43.121124
2021-1418912,2021-02-18,000001,Vente,179500,334,,AV FREDERIC MISTRAL,1812,83130,83062,La Garde,83,,,83062000AE0949,,,5,,8,66.4,,,,,,,2,2,Appartement,66,3,,,,,,6.005934,43.121124
2021-1418925,2021-02-01,000001,Vente,612000,152,,RUE BAGUIERS,1450,83130,83062,La Garde,83,,,83062000AC0766,,,,,,,,,,,,,0,1,Maison,122,5,S,sols,,,684,5.988885,43.118751
2021-1418947,2021-02-09,000001,Vente,1,1290,,AV DE DRAGUIGNAN,1701,83130,83062,La Garde,83,,,83062000AM0275,,,,,,,,,,,,,0,4,Local industriel. commercial ou assimilé,1280,0,S,sols,,,5100,6.037233,43.143897
2021-1418947,2021-02-09,000001,Vente,1,1290,,AV DE DRAGUIGNAN,1701,83130,83062,La Garde,83,,,83062000AM0275,,,,,,,,,,,,,0,4,Local industriel. commercial ou assimilé,987,0,S,sols,,,5100,6.037233,43.143897
2021-1419839,2021-02-16,000001,Vente,500000,975,,CHE DES PLANTADES,2448,83130,83062,La Garde,83,,,83062000AL0640,,,,,,,,,,,,,0,3,Dépendance,,0,S,sols,,,1000,6.020864,43.141803
2021-1419839,2021-02-16,000001,Vente,500000,975,,CHE DES PLANTADES,2448,83130,83062,La Garde,83,,,83062000AL0640,,,,,,,,,,,,,0,3,Dépendance,,0,AG,terrains d'agrément,,,1217,6.020864,43.141803
2021-1419839,2021-02-16,000001,Vente,500000,975,,CHE DES PLANTADES,2448,83130,83062,La Garde,83,,,83062000AL0640,,,,,,,,,,,,,0,1,Maison,86,4,AG,terrains d'agrément,,,1217,6.020864,43.141803
2021-1419839,2021-02-16,000001,Vente,500000,975,,CHE DES PLANTADES,2448,83130,83062,La Garde,83,,,83062000AL0640,,,,,,,,,,,,,0,4,Local industriel. commercial ou assimilé,26,0,AG,terrains d'agrément,,,1217,6.020864,43.141803
2021-1419839,2021-02-16,000001,Vente,500000,975,,CHE DES PLANTADES,2448,83130,83062,La Garde,83,,,83062000AL0640,,,,,,,,,,,,,0,1,Maison,86,4,S,sols,,,1000,6.020864,43.141803
2021-1419839,2021-02-16,000001,Vente,500000,975,,CHE DES PLANTADES,2448,83130,83062,La Garde,83,,,83062000AL0640,,,,,,,,,,,,,0,4,Local industriel. commercial ou assimilé,26,0,S,sols,,,1000,6.020864,43.141803
2021-1419841,2021-02-15,000001,Vente,156100,9001,,LES FLORALIES,A418,83130,83062,La Garde,83,,,83062000AI0739,,,10,,56,58.05,,,,,,,2,2,Appartement,55,3,,,,,,6.009053,43.126861
2021-1419841,2021-02-15,000001,Vente,156100,9001,,LES FLORALIES,A418,83130,83062,La Garde,83,,,83062000AI0739,,,10,,56,58.05,,,,,,,2,3,Dépendance,,0,,,,,,6.009053,43.126861
2021-1419877,2021-02-16,000001,Vente,698000,975,,CHE DES PLANTADES,2448,83130,83062,La Garde,83,,,83062000AL0641,,,,,,,,,,,,,0,3,Dépendance,,0,AG,terrains d'agrément,,,1010,6.020703,43.141919
2021-1419877,2021-02-16,000001,Vente,698000,975,,CHE DES PLANTADES,2448,83130,83062,La Garde,83,,,83062000AL0641,,,,,,,,,,,,,0,3,Dépendance,,0,S,sols,,,1000,6.020703,43.141919
2021-1419877,2021-02-16,000001,Vente,698000,975,,CHE DES PLANTADES,2448,83130,83062,La Garde,83,,,83062000AL0641,,,,,,,,,,,,,0,1,Maison,104,4,S,sols,,,1000,6.020703,43.141919
2021-1419877,2021-02-16,000001,Vente,698000,975,,CHE DES PLANTADES,2448,83130,83062,La Garde,83,,,83062000AL0641,,,,,,,,,,,,,0,3,Dépendance,,0,S,sols,,,1000,6.020703,43.141919
2021-1419877,2021-02-16,000001,Vente,698000,975,,CHE DES PLANTADES,2448,83130,83062,La Garde,83,,,83062000AL0641,,,,,,,,,,,,,0,3,Dépendance,,0,S,sols,,,1000,6.020703,43.141919
2021-1419877,2021-02-16,000001,Vente,698000,975,,CHE DES PLANTADES,2448,83130,83062,La Garde,83,,,83062000AL0641,,,,,,,,,,,,,0,3,Dépendance,,0,AG,terrains d'agrément,,,1010,6.020703,43.141919
2021-1419877,2021-02-16,000001,Vente,698000,975,,CHE DES PLANTADES,2448,83130,83062,La Garde,83,,,83062000AL0641,,,,,,,,,,,,,0,1,Maison,104,4,AG,terrains d'agrément,,,1010,6.020703,43.141919
2021-1419877,2021-02-16,000001,Vente,698000,975,,CHE DES PLANTADES,2448,83130,83062,La Garde,83,,,83062000AL0641,,,,,,,,,,,,,0,3,Dépendance,,0,AG,terrains d'agrément,,,1010,6.020703,43.141919
2021-1419939,2021-02-26,000001,Vente en l'état futur d'achèvement,171200,,,RUE FLORA TRISTAN,1771,83130,83062,La Garde,83,,,83062000AN0493,,,14,,,,,,,,,,1,,,,,,,,,,6.015493,43.12913
2021-1419939,2021-02-26,000001,Vente en l'état futur d'achèvement,171200,9005,,AV 1ER BIM DU PACIFIQUE,1479,83130,83062,La Garde,83,,,83062000AN1637,,,10,,,,,,,,,,1,,,,,,,,,,6.014911,43.12969
2021-1419939,2021-02-26,000001,Vente en l'état futur d'achèvement,171200,9005,,AV 1ER BIM DU PACIFIQUE,1479,83130,83062,La Garde,83,,,83062000AN1637,,,11,,,,,,,,,,1,,,,,,,,,,6.014911,43.12969
2021-1419941,2021-02-26,000001,Vente en l'état futur d'achèvement,372008,,,RUE FLORA TRISTAN,1771,83130,83062,La Garde,83,,,83062000AN0493,,,13,,,,,,,,,,1,,,,,,,,,,6.015493,43.12913
2021-1419941,2021-02-26,000001,Vente en l'état futur d'achèvement,372008,,,RUE FLORA TRISTAN,1771,83130,83062,La Garde,83,,,83062000AN0493,,,12,,,,,,,,,,1,,,,,,,,,,6.015493,43.12913
2021-1419941,2021-02-26,000001,Vente en l'état futur d'achèvement,372008,9005,,AV 1ER BIM DU PACIFIQUE,1479,83130,83062,La Garde,83,,,83062000AN1637,,,6,,,,,,,,,,1,,,,,,,,,,6.014911,43.12969
2021-1419961,2021-02-17,000001,Vente,355200,38,,IMP GEORGES BIZET,1859,83130,83062,La Garde,83,,,83062000AT0311,,,69,118.04,,,,,,,,,1,1,Maison,128,5,,,,,,5.998658,43.120196
2021-1419969,2021-02-16,000001,Vente,176000,303,,RUE MARC DELAGE,2168,83130,83062,La Garde,83,,,83062000AE0943,,,210,80.5,,,,,,,,,1,2,Appartement,81,3,,,,,,6.005584,43.124465
2021-1420043,2021-02-12,000001,Vente,318750,1,,IMP DE L'OLIVASTRE,2307,83130,83062,La Garde,83,,,83062000AC0643,,,,,,,,,,,,,0,3,Dépendance,,0,S,sols,,,417,5.991766,43.115864
2021-1420043,2021-02-12,000001,Vente,318750,1,,IMP DE L'OLIVASTRE,2307,83130,83062,La Garde,83,,,83062000AC0643,,,,,,,,,,,,,0,1,Maison,76,4,S,sols,,,417,5.991766,43.115864
2021-1420072,2021-02-12,000001,Vente,22000,53,,AV DE MONTESARCHIO,2250,83130,83062,La Garde,83,,,83062000AI0580,,,355,,,,,,,,,,1,3,Dépendance,,0,,,,,,6.008732,43.127049
2021-1420080,2021-02-10,000001,Vente,195800,288,,AV SADI CARNOT,2550,83130,83062,La Garde,83,,,83062000AE1058,,,6,55.43,,,,,,,,,1,2,Appartement,54,2,,,,,,6.005723,43.123997
2021-1420080,2021-02-10,000001,Vente,195800,288,,AV SADI CARNOT,2550,83130,83062,La Garde,83,,,83062000AE1058,,,26,,,,,,,,,,1,3,Dépendance,,0,,,,,,6.005723,43.123997
2021-1420165,2021-02-19,000001,Vente en l'état futur d'achèvement,250000,,,LES SAVELS,B104,83130,83062,La Garde,83,,,83062000AT1098,,,65,,,,,,,,,,1,,,,,,,,,,6.000157,43.11756
2021-1420165,2021-02-19,000001,Vente en l'état futur d'achèvement,250000,,,LES SAVELS,B104,83130,83062,La Garde,83,,,83062000AT1098,,,184,,,,,,,,,,1,,,,,,,,,,6.000157,43.11756
2021-1420165,2021-02-19,000001,Vente en l'état futur d'achèvement,250000,,,LES SAVELS,B104,83130,83062,La Garde,83,,,83062000AT1098,,,185,,,,,,,,,,1,,,,,,,,,,6.000157,43.11756
2021-1420300,2021-03-08,000001,Vente,15000,288,,AV SADI CARNOT,2550,83130,83062,La Garde,83,,,83062000AE1058,,,15,,,,,,,,,,1,3,Dépendance,,0,,,,,,6.005723,43.123997
2021-1420365,2021-02-15,000001,Vente,210000,285,,RUE ALBERT PIAULT,1355,83130,83062,La Garde,83,,,83062000AI0773,,,10,,,,,,,,,,1,3,Dépendance,,0,,,,,,6.005647,43.126783
2021-1420365,2021-02-15,000001,Vente,210000,285,,RUE ALBERT PIAULT,1355,83130,83062,La Garde,83,,,83062000AI0773,,,10,,,,,,,,,,1,2,Appartement,68,3,,,,,,6.005647,43.126783