id_mutation,date_mutation,numero_disposition,nature_mutation,valeur_fonciere,adresse_numero,adresse_suffixe,adresse_nom_voie,adresse_code_voie,code_postal,code_commune,nom_commune,code_departement,ancien_code_commune,ancien_nom_commune,id_parcelle,ancien_id_parcelle,numero_volume,lot1_numero,lot1_surface_carrez,lot2_numero,lot2_surface_carrez,lot3_numero,lot3_surface_carrez,lot4_numero,lot4_surface_carrez,lot5_numero,lot5_surface_carrez,nombre_lots,code_type_local,type_local,surface_reelle_bati,nombre_pieces_principales,code_nature_culture,nature_culture,code_nature_culture_speciale,nature_culture_speciale,surface_terrain,longitude,latitude
2021-1445245,2021-12-23,000002,Echange,3000,,,L ESTELLIER,B026,84390,84021,Brantes,84,,,840210000C0116,,,,,,,,,,,,,0,,,,,L,landes,,,10910,5.336543,44.178694
2021-1445553,2021-12-17,000001,Vente,508250,5036,,LE RANQUET,B061,84390,84021,Brantes,84,,,840210000E0350,,,,,,,,,,,,,0,1,Maison,140,3,S,sols,,,669,5.334634,44.195096
2021-1445553,2021-12-17,000001,Vente,508250,5036,,LE RANQUET,B061,84390,84021,Brantes,84,,,840210000E0350,,,,,,,,,,,,,0,4,Local industriel. commercial ou assimilé,40,0,S,sols,,,669,5.334634,44.195096
2021-1445553,2021-12-17,000001,Vente,508250,,,LE RANQUET,B061,84390,84021,Brantes,84,,,840210000E0663,,,,,,,,,,,,,0,,,,,S,sols,,,3,5.334578,44.195105
2021-1450776,2021-04-14,000001,Vente,90000,,,LA GRAND TERRE,B036,84390,84021,Brantes,84,,,840210000D0096,,,,,,,,,,,,,0,,,,,T,terres,,,4210,5.327597,44.189503
2021-1450776,2021-04-14,000001,Vente,90000,5023,,LA FRACHE,B032,84390,84021,Brantes,84,,,840210000D0097,,,,,,,,,,,,,0,1,Maison,80,3,J,jardins,,,473,5.328041,44.189619
2021-1450776,2021-04-14,000001,Vente,90000,5023,,LA FRACHE,B032,84390,84021,Brantes,84,,,840210000D0097,,,,,,,,,,,,,0,1,Maison,80,3,S,sols,,,500,5.328041,44.189619
2021-1450877,2021-04-29,000001,Vente,20000,5020,,LA FRACHE,B032,84390,84021,Brantes,84,,,840210000C0214,,,,,,,,,,,,,0,1,Maison,32,1,S,sols,,,39,5.328202,44.189593
2021-1451952,2021-08-03,000001,Vente,242000,,,LE COUTOUYON,B020,84390,84021,Brantes,84,,,840210000E0618,,,,,,,,,,,,,0,,,,,T,terres,,,5339,5.316088,44.195171
2021-1451952,2021-08-03,000001,Vente,242000,,,LE COUTOUYON,B020,84390,84021,Brantes,84,,,840210000E0620,,,,,,,,,,,,,0,,,,,L,landes,,,13889,5.315694,44.195057
2021-1451952,2021-08-03,000001,Vente,242000,5084,,LE COUTOUYON,B020,84390,84021,Brantes,84,,,840210000E0707,,,,,,,,,,,,,0,1,Maison,118,4,S,sols,,,1006,5.313801,44.195939
