id_mutation,date_mutation,numero_disposition,nature_mutation,valeur_fonciere,adresse_numero,adresse_suffixe,adresse_nom_voie,adresse_code_voie,code_postal,code_commune,nom_commune,code_departement,ancien_code_commune,ancien_nom_commune,id_parcelle,ancien_id_parcelle,numero_volume,lot1_numero,lot1_surface_carrez,lot2_numero,lot2_surface_carrez,lot3_numero,lot3_surface_carrez,lot4_numero,lot4_surface_carrez,lot5_numero,lot5_surface_carrez,nombre_lots,code_type_local,type_local,surface_reelle_bati,nombre_pieces_principales,code_nature_culture,nature_culture,code_nature_culture_speciale,nature_culture_speciale,surface_terrain,longitude,latitude
2021-1444799,2021-11-10,000001,Vente,245000,,,SOUS LE BARRY,B050,84110,84022,Buisson,84,,,840220000A0854,,,,,,,,,,,,,0,,,,,S,sols,,,87,4.995312,44.281735
2021-1444799,2021-11-10,000001,Vente,245000,290,,RTE DE VILLEDIEU,0005,84110,84022,Buisson,84,,,840220000A0856,,,,,,,,,,,,,0,3,Dépendance,,0,S,sols,,,413,4.995431,44.281702
2021-1444799,2021-11-10,000001,Vente,245000,290,,RTE DE VILLEDIEU,0005,84110,84022,Buisson,84,,,840220000A0856,,,,,,,,,,,,,0,1,Maison,76,4,S,sols,,,413,4.995431,44.281702
2021-1444799,2021-11-10,000001,Vente,245000,,,SOUS LE BARRY,B050,84110,84022,Buisson,84,,,840220000A0865,,,,,,,,,,,,,0,,,,,S,sols,,,48,4.995566,44.281596
2021-1445332,2021-11-29,000001,Vente,509500,5377,,SOUS LE BARRY,B050,84110,84022,Buisson,84,,,840220000A0490,,,,,,,,,,,,,0,1,Maison,235,5,S,sols,,,500,4.997779,44.281989
2021-1445332,2021-11-29,000001,Vente,509500,5377,,SOUS LE BARRY,B050,84110,84022,Buisson,84,,,840220000A0490,,,,,,,,,,,,,0,3,Dépendance,,0,J,jardins,,,1569,4.997779,44.281989
2021-1445332,2021-11-29,000001,Vente,509500,5377,,SOUS LE BARRY,B050,84110,84022,Buisson,84,,,840220000A0490,,,,,,,,,,,,,0,1,Maison,235,5,J,jardins,,,1569,4.997779,44.281989
2021-1445332,2021-11-29,000001,Vente,509500,5377,,SOUS LE BARRY,B050,84110,84022,Buisson,84,,,840220000A0490,,,,,,,,,,,,,0,3,Dépendance,,0,S,sols,,,500,4.997779,44.281989
2021-1450117,2021-01-13,000001,Vente,332000,5070,,GRAND PEREYROL,B022,84110,84022,Buisson,84,,,840220000B0223,,,,,,,,,,,,,0,1,Maison,84,4,S,sols,,,980,5.022269,44.276405
2021-1450117,2021-01-13,000001,Vente,332000,,,GRAND PEREYROL,B022,84110,84022,Buisson,84,,,840220000B0233,,,,,,,,,,,,,0,,,,,VI,vignes,,,1510,5.021916,44.276862
2021-1450117,2021-01-13,000001,Vente,332000,,,GRAND PEREYROL,B022,84110,84022,Buisson,84,,,840220000B0234,,,,,,,,,,,,,0,,,,,B,bois,,,510,5.02126,44.276723
2021-1450117,2021-01-13,000001,Vente,332000,,,GRAND PEREYROL,B022,84110,84022,Buisson,84,,,840220000B0754,,,,,,,,,,,,,0,,,,,B,bois,,,5360,5.021544,44.27718
2021-1450117,2021-01-13,000001,Vente,332000,,,GRAND PEREYROL,B022,84110,84022,Buisson,84,,,840220000B0838,,,,,,,,,,,,,0,,,,,VI,vignes,,,735,5.022168,44.276349
2021-1450117,2021-01-13,000001,Vente,332000,5071,,GRAND PEREYROL,B022,84110,84022,Buisson,84,,,840220000B0840,,,,,,,,,,,,,0,1,Maison,60,3,S,sols,,,1030,5.022335,44.276725
2021-1450117,2021-01-13,000001,Vente,332000,,,GRAND PEREYROL,B022,84110,84022,Buisson,84,,,840220000B0842,,,,,,,,,,,,,0,,,,,VI,vignes,,,460,5.022421,44.276787
2021-1450117,2021-01-13,000001,Vente,332000,,,GRAND PEREYROL,B022,84110,84022,Buisson,84,,,840220000B0844,,,,,,,,,,,,,0,,,,,VI,vignes,,,200,5.022289,44.276949
2021-1450117,2021-01-13,000001,Vente,332000,,,GRAND PEREYROL,B022,84110,84022,Buisson,84,,,840220000B0846,,,,,,,,,,,,,0,,,,,T,terres,,,15,5.022007,44.276577
2021-1450242,2021-01-11,000001,Vente,314400,,,LA CROZE,B014,84110,84022,Buisson,84,,,840220000B0807,,,,,,,,,,,,,0,,,,,AB,terrains a bâtir,,,84,4.998929,44.278851
2021-1450242,2021-01-11,000001,Vente,314400,,,LA CROZE,B014,84110,84022,Buisson,84,,,840220000B0809,,,,,,,,,,,,,0,,,,,AB,terrains a bâtir,,,34,4.998766,44.278934
2021-1450242,2021-01-11,000001,Vente,314400,,,LA CROZE,B014,84110,84022,Buisson,84,,,840220000B0811,,,,,,,,,,,,,0,,,,,VI,vignes,,,91,4.998592,44.279029
2021-1450242,2021-01-11,000001,Vente,314400,9001,,FONT VIEILLE,B018,84110,84022,Buisson,84,,,840220000B0813,,,,,,,,,,,,,0,1,Maison,100,3,J,jardins,,,882,4.998858,44.279025
2021-1450242,2021-01-11,000001,Vente,314400,9001,,FONT VIEILLE,B018,84110,84022,Buisson,84,,,840220000B0813,,,,,,,,,,,,,0,1,Maison,65,2,S,sols,,,500,4.998858,44.279025
2021-1450242,2021-01-11,000001,Vente,314400,9001,,FONT VIEILLE,B018,84110,84022,Buisson,84,,,840220000B0813,,,,,,,,,,,,,0,1,Maison,100,3,S,sols,,,500,4.998858,44.279025
2021-1450242,2021-01-11,000001,Vente,314400,9001,,FONT VIEILLE,B018,84110,84022,Buisson,84,,,840220000B0813,,,,,,,,,,,,,0,1,Maison,65,2,J,jardins,,,882,4.998858,44.279025
2021-1450331,2021-02-10,000002,Vente,45000,,,LA ROCHE,B047,84110,84022,Buisson,84,,,840220000C0006,,,,,,,,,,,,,0,,,,,T,terres,,,2000,4.9754,44.273531
2021-1450331,2021-02-10,000002,Vente,45000,,,LA ROCHE,B047,84110,84022,Buisson,84,,,840220000C0006,,,,,,,,,,,,,0,,,,,VI,vignes,,,9700,4.9754,44.273531
2021-1450331,2021-02-10,000002,Vente,45000,,,LA ROCHE,B047,84110,84022,Buisson,84,,,840220000C0008,,,,,,,,,,,,,0,,,,,VI,vignes,,,9120,4.976941,44.273383
2021-1450860,2021-04-29,000001,Vente,245500,5039,,LE VILLAGE,B052,84110,84022,Buisson,84,,,840220000A0571,,,,,,,,,,,,,0,1,Maison,75,5,S,sols,,,80,4.9978,44.280105
2021-1450867,2021-04-29,000001,Vente,359900,,,LA CROZE,B014,84110,84022,Buisson,84,,,840220000B0073,,,,,,,,,,,,,0,,,,,L,landes,,,160,5.000206,44.2791
2021-1450867,2021-04-29,000001,Vente,359900,,,LA CROZE,B014,84110,84022,Buisson,84,,,840220000B0074,,,,,,,,,,,,,0,,,,,S,sols,,,372,5.00042,44.279148
2021-1450867,2021-04-29,000001,Vente,359900,5129,,LA CROZE,B014,84110,84022,Buisson,84,,,840220000B0075,,,,,,,,,,,,,0,1,Maison,110,4,S,sols,,,338,5.000382,44.278999
2021-1450867,2021-04-29,000001,Vente,359900,,,LA CROZE,B014,84110,84022,Buisson,84,,,840220000B0772,,,,,,,,,,,,,0,,,,,VE,vergers,,,63,5.000488,44.278986
2021-1450867,2021-04-29,000001,Vente,359900,,,LA CROZE,B014,84110,84022,Buisson,84,,,840220000B0934,,,,,,,,,,,,,0,,,,,S,sols,,,68,5.000182,44.278799
2021-1450867,2021-04-29,000001,Vente,359900,,,LA CROZE,B014,84110,84022,Buisson,84,,,840220000B0936,,,,,,,,,,,,,0,,,,,S,sols,,,139,5.000123,44.278825
2021-1450970,2021-05-17,000001,Vente,54560,,,GRAND PEREYROL,B022,84110,84022,Buisson,84,,,840220000B0229,,,,,,,,,,,,,0,,,,,VI,vignes,,,7520,5.021266,44.278559
2021-1450970,2021-05-17,000001,Vente,54560,,,GRAND PEREYROL,B022,84110,84022,Buisson,84,,,840220000B0230,,,,,,,,,,,,,0,,,,,VI,vignes,,,4480,5.020154,44.278711
2021-1450970,2021-05-17,000001,Vente,54560,,,GRAND PEREYROL,B022,84110,84022,Buisson,84,,,840220000B0732,,,,,,,,,,,,,0,,,,,VI,vignes,,,2820,5.019334,44.279027
2021-1450970,2021-05-17,000001,Vente,54560,,,GRAND PEREYROL,B022,84110,84022,Buisson,84,,,840220000B0733,,,,,,,,,,,,,0,,,,,VI,vignes,,,490,5.019406,44.278452
2021-1450970,2021-05-17,000001,Vente,54560,,,GRAND PEREYROL,B022,84110,84022,Buisson,84,,,840220000B0753,,,,,,,,,,,,,0,,,,,VI,vignes,,,9530,5.020358,44.277977
2021-1450979,2021-05-11,000001,Vente,14500,,,NOTRE DAME BASSE,B033,84110,84022,Buisson,84,,,840220000A0432,,,,,,,,,,,,,0,,,,,VI,vignes,,,6350,5.00997,44.281526
2021-1451006,2021-05-04,000001,Vente,12000,,,RAMIERES HAUTES,B044,84110,84022,Buisson,84,,,840220000A0185,,,,,,,,,,,,,0,,,,,T,terres,,,610,5.011134,44.288708
2021-1451006,2021-05-04,000001,Vente,12000,,,RAMIERES HAUTES,B044,84110,84022,Buisson,84,,,840220000A0186,,,,,,,,,,,,,0,,,,,T,terres,,,945,5.011312,44.288195
2021-1451006,2021-05-04,000001,Vente,12000,,,RAMIERES HAUTES,B044,84110,84022,Buisson,84,,,840220000A0236,,,,,,,,,,,,,0,,,,,T,terres,,,3025,5.017024,44.288671
2021-1451006,2021-05-04,000001,Vente,12000,,,RAMIERES HAUTES,B044,84110,84022,Buisson,84,,,840220000A0240,,,,,,,,,,,,,0,,,,,T,terres,,,1535,5.015352,44.289301
2021-1451006,2021-05-04,000001,Vente,12000,,,RAMIERES HAUTES,B044,84110,84022,Buisson,84,,,840220000A0241,,,,,,,,,,,,,0,,,,,T,terres,,,1055,5.015164,44.289257
2021-1451006,2021-05-04,000001,Vente,12000,,,RAMIERES HAUTES,B044,84110,84022,Buisson,84,,,840220000A0248,,,,,,,,,,,,,0,,,,,T,terres,,,1730,5.014435,44.289269
2021-1451006,2021-05-04,000001,Vente,12000,,,LES LOTS,B032,84110,84022,Buisson,84,,,840220000A0258,,,,,,,,,,,,,0,,,,,T,terres,,,2230,5.012858,44.286913
2021-1451006,2021-05-04,000001,Vente,12000,,,NOTRE DAME HAUTE,B034,84110,84022,Buisson,84,,,840220000A0383,,,,,,,,,,,,,0,,,,,T,terres,,,5030,5.018223,44.284563
2021-1451006,2021-05-04,000001,Vente,12000,,,NOTRE DAME HAUTE,B034,84110,84022,Buisson,84,,,840220000A0385,,,,,,,,,,,,,0,,,,,L,landes,,,1810,5.017611,44.284146
2021-1451399,2021-06-21,000001,Vente,312199,5118,,NOTRE DAME HAUTE,B034,84110,84022,Buisson,84,,,840220000A0658,,,,,,,,,,,,,0,3,Dépendance,,0,S,sols,,,600,5.01561,44.283996
2021-1451399,2021-06-21,000001,Vente,312199,5118,,NOTRE DAME HAUTE,B034,84110,84022,Buisson,84,,,840220000A0658,,,,,,,,,,,,,0,1,Maison,77,3,S,sols,,,600,5.01561,44.283996
2021-1451399,2021-06-21,000001,Vente,312199,5118,,NOTRE DAME HAUTE,B034,84110,84022,Buisson,84,,,840220000A0658,,,,,,,,,,,,,0,3,Dépendance,,0,B,bois,,,1430,5.01561,44.283996
2021-1451399,2021-06-21,000001,Vente,312199,5118,,NOTRE DAME HAUTE,B034,84110,84022,Buisson,84,,,840220000A0658,,,,,,,,,,,,,0,3,Dépendance,,0,B,bois,,,1430,5.01561,44.283996
2021-1451399,2021-06-21,000001,Vente,312199,5118,,NOTRE DAME HAUTE,B034,84110,84022,Buisson,84,,,840220000A0658,,,,,,,,,,,,,0,3,Dépendance,,0,S,sols,,,600,5.01561,44.283996
2021-1451399,2021-06-21,000001,Vente,312199,5118,,NOTRE DAME HAUTE,B034,84110,84022,Buisson,84,,,840220000A0658,,,,,,,,,,,,,0,1,Maison,77,3,B,bois,,,1430,5.01561,44.283996
2021-1451588,2021-07-21,000001,Vente,169000,5027,,LE VILLAGE,B052,84110,84022,Buisson,84,,,840220000A0661,,,,,,,,,,,,,0,1,Maison,100,4,S,sols,,,81,4.997467,44.280585
2021-1451769,2021-08-03,000001,Vente,285000,5123,,GUILLAVES,B026,84110,84022,Buisson,84,,,840220000C0246,,,,,,,,,,,,,0,3,Dépendance,,0,S,sols,,,600,4.998987,44.277876
2021-1451769,2021-08-03,000001,Vente,285000,5123,,GUILLAVES,B026,84110,84022,Buisson,84,,,840220000C0246,,,,,,,,,,,,,0,3,Dépendance,,0,J,jardins,,,785,4.998987,44.277876
2021-1451769,2021-08-03,000001,Vente,285000,5123,,GUILLAVES,B026,84110,84022,Buisson,84,,,840220000C0246,,,,,,,,,,,,,0,1,Maison,108,5,S,sols,,,600,4.998987,44.277876
2021-1451769,2021-08-03,000001,Vente,285000,5123,,GUILLAVES,B026,84110,84022,Buisson,84,,,840220000C0246,,,,,,,,,,,,,0,1,Maison,108,5,J,jardins,,,785,4.998987,44.277876
2021-1451769,2021-08-03,000001,Vente,285000,,,GUILLAVES,B026,84110,84022,Buisson,84,,,840220000C0385,,,,,,,,,,,,,0,,,,,T,terres,,,656,4.999248,44.277777
2021-1451838,2021-07-30,000001,Vente,145000,9001,,RUE GRANDE RUE,0027,84110,84022,Buisson,84,,,840220000A0532,,,,,,,,,,,,,0,1,Maison,95,4,S,sols,,,285,4.998121,44.280519
2021-1451916,2021-08-13,000001,Vente,30000,,,LE JAS,B030,84110,84022,Buisson,84,,,840220000C0100,,,,,,,,,,,,,0,,,,,VI,vignes,,,990,4.988438,44.271723
2021-1451916,2021-08-13,000001,Vente,30000,,,LE JAS,B030,84110,84022,Buisson,84,,,840220000C0101,,,,,,,,,,,,,0,,,,,S,sols,,,20,4.988094,44.271948
2021-1451916,2021-08-13,000001,Vente,30000,,,LE JAS,B030,84110,84022,Buisson,84,,,840220000C0439,,,,,,,,,,,,,0,,,,,VI,vignes,,,3715,4.988456,44.271551
2021-1451916,2021-08-13,000001,Vente,30000,,,LE JAS,B030,84110,84022,Buisson,84,,,840220000C0440,,,,,,,,,,,,,0,,,,,VI,vignes,,,75,4.988281,44.272872
2021-1451916,2021-08-13,000001,Vente,30000,,,LE JAS,B030,84110,84022,Buisson,84,,,840220000C0441,,,,,,,,,,,,,0,,,,,VI,vignes,,,2150,4.988435,44.272612
2021-1451916,2021-08-13,000001,Vente,30000,,,LE JAS,B030,84110,84022,Buisson,84,,,840220000C0442,,,,,,,,,,,,,0,,,,,VI,vignes,,,2400,4.988699,44.271989
2021-1451971,2021-09-02,000001,Vente,370000,5136,,LA PLANE,B039,84110,84022,Buisson,84,,,840220000A0471,,,,,,,,,,,,,0,1,Maison,114,4,J,jardins,,,1193,5.000328,44.280747
2021-1451971,2021-09-02,000001,Vente,370000,5136,,LA PLANE,B039,84110,84022,Buisson,84,,,840220000A0471,,,,,,,,,,,,,0,1,Maison,114,4,L,landes,,,2057,5.000328,44.280747
2021-1451971,2021-09-02,000001,Vente,370000,5136,,LA PLANE,B039,84110,84022,Buisson,84,,,840220000A0471,,,,,,,,,,,,,0,1,Maison,114,4,S,sols,,,500,5.000328,44.280747
2021-1451971,2021-09-02,000001,Vente,370000,,,LA PLANE,B039,84110,84022,Buisson,84,,,840220000A0472,,,,,,,,,,,,,0,,,,,B,bois,,,4475,4.999607,44.280494
2021-1451982,2021-09-02,000001,Vente,4000,,,RAMIERES HAUTES,B044,84110,84022,Buisson,84,,,840220000A0217,,,,,,,,,,,,,0,,,,,T,terres,,,1695,5.016114,44.290496
2021-1451982,2021-09-02,000001,Vente,4000,,,LES PRES,B040,84110,84022,Buisson,84,,,840220000A0293,,,,,,,,,,,,,0,,,,,P,prés,,,2240,5.020249,44.28765
2021-1452081,2021-09-15,000001,Vente,342340,,,LE BOUSSILLON,B005,84110,84022,Buisson,84,,,840220000B0826,,,,,,,,,,,,,0,,,,,S,sols,,,5,5.02457,44.265728
2021-1452081,2021-09-15,000001,Vente,342340,5365,,LE BOUSSILLON,B005,84110,84022,Buisson,84,,,840220000B0829,,,,,,,,,,,,,0,1,Maison,77,4,S,sols,,,500,5.024374,44.266259
2021-1452081,2021-09-15,000001,Vente,342340,5365,,LE BOUSSILLON,B005,84110,84022,Buisson,84,,,840220000B0829,,,,,,,,,,,,,0,1,Maison,77,4,B,bois,,,916,5.024374,44.266259
2021-1452081,2021-09-15,000001,Vente,342340,,,LE BOUSSILLON,B005,84110,84022,Buisson,84,,,840220000B0833,,,,,,,,,,,,,0,,,,,S,sols,,,206,5.02476,44.266205
2021-1452081,2021-09-15,000001,Vente,342340,,,LE BOUSSILLON,B005,84110,84022,Buisson,84,,,840220000B0834,,,,,,,,,,,,,0,,,,,S,sols,,,220,5.024501,44.265636
2021-1452081,2021-09-15,000001,Vente,342340,,,LE BOUSSILLON,B005,84110,84022,Buisson,84,,,840220000B0836,,,,,,,,,,,,,0,,,,,VI,vignes,,,155,5.024626,44.265922
2021-1452163,2021-09-17,000001,Vente,55000,,,LA BAYSSE,B002,84110,84022,Buisson,84,,,840220000D0435,,,,,,,,,,,,,0,,,,,S,sols,,,30,4.985107,44.282349
2021-1452163,2021-09-17,000001,Vente,55000,,,LA BAYSSE,B002,84110,84022,Buisson,84,,,840220000D0551,,,,,,,,,,,,,0,,,,,VE,vergers,,,1429,4.985084,44.282353
