id_mutation,date_mutation,numero_disposition,nature_mutation,valeur_fonciere,adresse_numero,adresse_suffixe,adresse_nom_voie,adresse_code_voie,code_postal,code_commune,nom_commune,code_departement,ancien_code_commune,ancien_nom_commune,id_parcelle,ancien_id_parcelle,numero_volume,lot1_numero,lot1_surface_carrez,lot2_numero,lot2_surface_carrez,lot3_numero,lot3_surface_carrez,lot4_numero,lot4_surface_carrez,lot5_numero,lot5_surface_carrez,nombre_lots,code_type_local,type_local,surface_reelle_bati,nombre_pieces_principales,code_nature_culture,nature_culture,code_nature_culture_speciale,nature_culture_speciale,surface_terrain,longitude,latitude
2021-1444128,2021-11-25,000002,Vente,9000,,,VIEUX TRAVAILLAN,B013,84850,84134,Travaillan,84,,,841340000E0050,,,,,,,,,,,,,0,,,,,VI,vignes,,,4775,4.879187,44.177293
2021-1444128,2021-11-25,000002,Vente,9000,,,VIEUX TRAVAILLAN,B013,84850,84134,Travaillan,84,,,841340000E0790,,,,,,,,,,,,,0,,,,,VI,vignes,,,4104,4.879343,44.177075
2021-1444198,2021-11-25,000001,Vente,2000,,,VIEUX TRAVAILLAN,B013,84850,84134,Travaillan,84,,,841340000E0791,,,,,,,,,,,,,0,,,,,VI,vignes,,,1174,4.879534,44.177055
2021-1450173,2021-01-22,000001,Vente,250000,,,GRAND PRE,B002,84850,84134,Travaillan,84,,,841340000E0336,,,,,,,,,,,,,0,,,,,B,bois,,,840,4.872915,44.174262
2021-1450173,2021-01-22,000001,Vente,250000,5123,,GRAND PRE,B002,84850,84134,Travaillan,84,,,841340000E0628,,,,,,,,,,,,,0,1,Maison,145,5,S,sols,,,437,4.873361,44.174359
2021-1450173,2021-01-22,000001,Vente,250000,5247,,GRAND PRE,B002,84850,84134,Travaillan,84,,,841340000E0629,,,2,,3,,,,,,,,2,3,Dépendance,,0,,,,,,4.87337,44.174436
2021-1450549,2021-03-05,000001,Vente,4715,,,VIEUX TRAVAILLAN,B013,84850,84134,Travaillan,84,,,841340000E0051,,,,,,,,,,,,,0,,,,,VI,vignes,,,4715,4.879176,44.177573
2021-1450584,2021-03-05,000001,Vente,340000,,,LA GENESTIERE,B001,84850,84134,Travaillan,84,,,841340000B0399,,,,,,,,,,,,,0,,,,,VI,vignes,,,2806,4.899404,44.191364
2021-1450584,2021-03-05,000001,Vente,340000,,,LA GENESTIERE,B001,84850,84134,Travaillan,84,,,841340000B0400,,,,,,,,,,,,,0,,,,,VI,vignes,,,2444,4.899435,44.19161
2021-1450584,2021-03-05,000001,Vente,340000,5070,,LA GENESTIERE,B001,84850,84134,Travaillan,84,,,841340000B0540,,,,,,,,,,,,,0,1,Maison,100,5,S,sols,,,514,4.898857,44.191813
2021-1450584,2021-03-05,000001,Vente,340000,,,LA GENESTIERE,B001,84850,84134,Travaillan,84,,,841340000B0541,,,,,,,,,,,,,0,,,,,S,sols,,,38,4.899013,44.191773
2021-1450892,2021-04-15,000001,Vente,589360,5022,,SAINT PAUL,B009,84850,84134,Travaillan,84,,,841340000B0033,,,,,,,,,,,,,0,1,Maison,185,6,S,sols,,,358,4.903743,44.19659
2021-1450892,2021-04-15,000001,Vente,589360,,,SAINT PAUL,B009,84850,84134,Travaillan,84,,,841340000B0034,,,,,,,,,,,,,0,,,,,T,terres,,,2027,4.903867,44.196325
2021-1450892,2021-04-15,000001,Vente,589360,,,SAINT PAUL,B009,84850,84134,Travaillan,84,,,841340000B0034,,,,,,,,,,,,,0,,,,,VI,vignes,,,3453,4.903867,44.196325
2021-1450892,2021-04-15,000001,Vente,589360,,,SAINT PAUL,B009,84850,84134,Travaillan,84,,,841340000B0035,,,,,,,,,,,,,0,,,,,VI,vignes,,,2847,4.90471,44.196151
2021-1450991,2021-05-07,000001,Vente,230000,850,,RTE DE SAINTE CECILE,0028,84850,84134,Travaillan,84,,,841340000A0573,,,,,,,,,,,,,0,2,Appartement,35,2,S,sols,,,836,4.889209,44.193655
2021-1450991,2021-05-07,000001,Vente,230000,850,,RTE DE SAINTE CECILE,0028,84850,84134,Travaillan,84,,,841340000A0573,,,,,,,,,,,,,0,1,Maison,96,4,S,sols,,,836,4.889209,44.193655
2021-1450991,2021-05-07,000001,Vente,230000,850,,RTE DE SAINTE CECILE,0028,84850,84134,Travaillan,84,,,841340000A0573,,,,,,,,,,,,,0,1,Maison,96,4,VI,vignes,,,1666,4.889209,44.193655
2021-1450991,2021-05-07,000001,Vente,230000,850,,RTE DE SAINTE CECILE,0028,84850,84134,Travaillan,84,,,841340000A0573,,,,,,,,,,,,,0,2,Appartement,35,2,VI,vignes,,,1666,4.889209,44.193655
2021-1451031,2021-04-30,000001,Vente,248700,5204,,SAINT PAUL,B009,84850,84134,Travaillan,84,,,841340000B0530,,,,,,,,,,,,,0,1,Maison,101,4,T,terres,,,1530,4.90532,44.194328
2021-1451031,2021-04-30,000001,Vente,248700,5204,,SAINT PAUL,B009,84850,84134,Travaillan,84,,,841340000B0530,,,,,,,,,,,,,0,1,Maison,101,4,S,sols,,,970,4.90532,44.194328
2021-1451079,2021-05-28,000001,Vente,13000,,,GRANDE TERRE,B003,84850,84134,Travaillan,84,,,841340000E0128,,,,,,,,,,,,,0,,,,,VI,vignes,,,9254,4.889369,44.179364
2021-1451110,2021-05-10,000001,Vente,68675,,,PLAN DE DIEU,B005,84850,84134,Travaillan,84,,,841340000D0234,,,,,,,,,,,,,0,,,,,VI,vignes,,,13061,4.916931,44.174709
2021-1451253,2021-05-28,000001,Vente,341160,,,VELAGE,B012,84850,84134,Travaillan,84,,,841340000C0530,,,,,,,,,,,,,0,,,,,VI,vignes,,,80000,4.920999,44.199592
2021-1451413,2021-06-25,000001,Vente,280000,5092,,GRANDE TERRE,B003,84850,84134,Travaillan,84,,,841340000E0109,,,,,,,,,,,,,0,1,Maison,150,4,S,sols,,,120,4.889107,44.17537
2021-1451413,2021-06-25,000001,Vente,280000,,,GRANDE TERRE,B003,84850,84134,Travaillan,84,,,841340000E0110,,,,,,,,,,,,,0,,,,,VI,vignes,,,6660,4.888758,44.174907
2021-1451413,2021-06-25,000001,Vente,280000,,,GRANDE TERRE,B003,84850,84134,Travaillan,84,,,841340000E0111,,,,,,,,,,,,,0,,,,,T,terres,,,6284,4.888643,44.175653
2021-1451413,2021-06-25,000001,Vente,280000,,,GRANDE TERRE,B003,84850,84134,Travaillan,84,,,841340000E0534,,,,,,,,,,,,,0,,,,,S,sols,,,55,4.889211,44.17536
2021-1451413,2021-06-25,000001,Vente,280000,,,GRANDE TERRE,B003,84850,84134,Travaillan,84,,,841340000E0537,,,,,,,,,,,,,0,,,,,S,sols,,,29,4.889271,44.175043
2021-1451569,2021-06-30,000001,Vente,276000,5227,,VIEUX TRAVAILLAN,B013,84850,84134,Travaillan,84,,,841340000E0603,,,,,,,,,,,,,0,3,Dépendance,,0,S,sols,,,500,4.885639,44.179606
2021-1451569,2021-06-30,000001,Vente,276000,5227,,VIEUX TRAVAILLAN,B013,84850,84134,Travaillan,84,,,841340000E0603,,,,,,,,,,,,,0,1,Maison,104,4,S,sols,,,500,4.885639,44.179606
2021-1451569,2021-06-30,000001,Vente,276000,5227,,VIEUX TRAVAILLAN,B013,84850,84134,Travaillan,84,,,841340000E0603,,,,,,,,,,,,,0,3,Dépendance,,0,T,terres,,,1020,4.885639,44.179606
2021-1451569,2021-06-30,000001,Vente,276000,5227,,VIEUX TRAVAILLAN,B013,84850,84134,Travaillan,84,,,841340000E0603,,,,,,,,,,,,,0,1,Maison,104,4,T,terres,,,1020,4.885639,44.179606
2021-1451980,2021-09-02,000001,Vente,275000,5196,,GRAND PRE,B002,84850,84134,Travaillan,84,,,841340000E0347,,,,,,,,,,,,,0,1,Maison,149,5,S,sols,,,662,4.874139,44.174033
2021-1452048,2021-07-02,000001,Echange,27560,,,SAINT JEAN,B008,84850,84134,Travaillan,84,,,841340000B0214,,,,,,,,,,,,,0,,,,,VI,vignes,,,10100,4.904655,44.188602
2021-1452048,2021-07-02,000001,Echange,27560,,,SAINT JEAN,B008,84850,84134,Travaillan,84,,,841340000B0215,,,,,,,,,,,,,0,,,,,P,prés,,,130,4.903216,44.18879
2021-1452048,2021-07-02,000001,Echange,27560,,,SAINT JEAN,B008,84850,84134,Travaillan,84,,,841340000B0215,,,,,,,,,,,,,0,,,,,VI,vignes,,,8400,4.903216,44.18879
2021-1452053,2021-09-01,000001,Vente,1000,,,TRAVAILLAN,B011,84850,84134,Travaillan,84,,,841340000E0237,,,,,,,,,,,,,0,,,,,T,terres,,,1787,4.882646,44.175941
