id_mutation,date_mutation,numero_disposition,nature_mutation,valeur_fonciere,adresse_numero,adresse_suffixe,adresse_nom_voie,adresse_code_voie,code_postal,code_commune,nom_commune,code_departement,ancien_code_commune,ancien_nom_commune,id_parcelle,ancien_id_parcelle,numero_volume,lot1_numero,lot1_surface_carrez,lot2_numero,lot2_surface_carrez,lot3_numero,lot3_surface_carrez,lot4_numero,lot4_surface_carrez,lot5_numero,lot5_surface_carrez,nombre_lots,code_type_local,type_local,surface_reelle_bati,nombre_pieces_principales,code_nature_culture,nature_culture,code_nature_culture_speciale,nature_culture_speciale,surface_terrain,longitude,latitude
2021-1452513,2021-01-08,000001,Vente,175000,2,,RUE DES OUCHETTES,0815,85110,85051,Chantonnay,85,,,85051000BP0034,,,,,,,,,,,,,0,1,Maison,93,4,J,jardins,,,806,-1.046403,46.66816
2021-1452513,2021-01-08,000001,Vente,175000,2,,RUE DES OUCHETTES,0815,85110,85051,Chantonnay,85,,,85051000BP0034,,,,,,,,,,,,,0,1,Maison,93,4,S,sols,,,500,-1.046403,46.66816
2021-1452517,2021-01-05,000001,Vente,110000,7,,RUE SAINT HILAIRE,0928,85110,85051,Chantonnay,85,,,85051000AV0019,,,,,,,,,,,,,0,1,Maison,85,4,S,sols,,,990,-1.063204,46.684989
2021-1452521,2021-01-13,000001,Vente terrain à bâtir,21500,1,,RUE DU GYPSE,0445,85110,85051,Chantonnay,85,,,85051000XV0142,,,,,,,,,,,,,0,,,,,AB,terrains a bâtir,,,398,-1.037129,46.68207
2021-1452522,2021-01-11,000001,Vente,40000,5,,RUE DE METZ,0740,85110,85051,Chantonnay,85,,,85051000BA0199,,,,,,,,,,,,,0,,,,,S,sols,,,142,-1.050878,46.688808
2021-1452522,2021-01-11,000001,Vente,40000,5,,RUE DE METZ,0740,85110,85051,Chantonnay,85,,,85051000BA0255,,,,,,,,,,,,,0,1,Maison,83,3,S,sols,,,142,-1.050807,46.688661
2021-1452523,2021-01-08,000001,Vente,85000,3,,RUE DES VIGNERONS,1025,85110,85051,Chantonnay,85,,,85051000YB0363,,,,,,,,,,,,,0,1,Maison,96,3,S,sols,,,602,-1.043163,46.643089
2021-1452563,2021-01-15,000001,Vente,500,,,RUE NATIONALE,0780,85110,85051,Chantonnay,85,,,85051000BH0116,,,,,,,,,,,,,0,,,,,S,sols,,,15,-1.050912,46.686544
2021-1452571,2021-01-15,000001,Vente,17000,5,,RUE DE LA FORGE,0325,85110,85051,Chantonnay,85,,,850510000M1765,,,,,,,,,,,,,0,,,,,S,sols,,,365,-0.999672,46.683546
2021-1452698,2021-01-18,000001,Vente,96000,5,,RUE DU SYNODE,0959,85110,85051,Chantonnay,85,,,85051000AC0023,,,,,,,,,,,,,0,1,Maison,100,3,S,sols,,,716,-1.030283,46.708465
2021-1452701,2021-01-21,000001,Vente,65000,55,,RUE NATIONALE,0780,85110,85051,Chantonnay,85,,,85051000BE0312,,,17,36.92,,,,,,,,,1,2,Appartement,37,2,,,,,,-1.050704,46.686933
2021-1452704,2021-01-21,000001,Vente,73000,,,RUE BELLIARD,0060,85110,85051,Chantonnay,85,,,85051000BC0096,,,,,,,,,,,,,0,,,,,T,terres,,,216,-1.044482,46.691353
2021-1452704,2021-01-21,000001,Vente,73000,22,,RUE BELLIARD,0060,85110,85051,Chantonnay,85,,,85051000BC0121,,,,,,,,,,,,,0,1,Maison,110,4,S,sols,,,405,-1.04491,46.691619
2021-1452704,2021-01-21,000001,Vente,73000,,,RUE BELLIARD,0060,85110,85051,Chantonnay,85,,,85051000BC0124,,,,,,,,,,,,,0,,,,,S,sols,,,42,-1.044742,46.69149
2021-1452704,2021-01-21,000001,Vente,73000,,,RUE BELLIARD,0060,85110,85051,Chantonnay,85,,,85051000BC0129,,,,,,,,,,,,,0,,,,,S,sols,,,12,-1.044947,46.691619
2021-1452740,2021-01-19,000001,Vente,14220,7,,RUE DE LA SAULNERIE,0936,85110,85051,Chantonnay,85,,,85051000AC0235,,,,,,,,,,,,,0,3,Dépendance,,0,J,jardins,,,474,-1.032384,46.70632
2021-1452877,2021-01-26,000001,Vente,205000,12,,IMP DES CALINS,0133,85110,85051,Chantonnay,85,,,85051000AY0147,,,,,,,,,,,,,0,,,,,S,sols,,,422,-1.062938,46.678082
2021-1452877,2021-01-26,000001,Vente,205000,14,,IMP DES CALINS,0133,85110,85051,Chantonnay,85,,,85051000AY0149,,,,,,,,,,,,,0,1,Maison,107,5,J,jardins,,,816,-1.062859,46.678448
2021-1452877,2021-01-26,000001,Vente,205000,14,,IMP DES CALINS,0133,85110,85051,Chantonnay,85,,,85051000AY0149,,,,,,,,,,,,,0,1,Maison,107,5,S,sols,,,500,-1.062859,46.678448
2021-1453026,2021-01-27,000001,Vente,1000,,,CHAMP DE LA FONTAINE,B148,85110,85051,Chantonnay,85,,,850510000C3065,,,,,,,,,,,,,0,,,,,BT,taillis simples,,,4643,-1.067799,46.676217
2021-1453028,2021-01-28,000001,Vente,155000,12,,IMP DES COLIBRIS,0181,85110,85051,Chantonnay,85,,,85051000AT0110,,,,,,,,,,,,,0,1,Maison,80,4,S,sols,,,666,-1.055711,46.689655
2021-1453029,2021-02-01,000001,Vente terrain à bâtir,40008.9,,,LES BOUALES,B077,85110,85051,Chantonnay,85,,,85051000AO0066,,,,,,,,,,,,,0,,,,,AB,terrains a bâtir,,,691,-1.059989,46.692436
2021-1453039,2021-02-04,000001,Vente,150000,33,,IMP DES GLANNES,0422,85110,85051,Chantonnay,85,,,850510000O0420,,,,,,,,,,,,,0,1,Maison,76,4,S,sols,,,392,-1.015393,46.662307
2021-1453039,2021-02-04,000001,Vente,150000,31,B,RUE DE VILDE,1033,85110,85051,Chantonnay,85,,,850510000O0877,,,,,,,,,,,,,0,,,,,S,sols,,,280,-1.015194,46.662374
2021-1453039,2021-02-04,000001,Vente,150000,,,VILDE,B925,85110,85051,Chantonnay,85,,,850510000O1102,,,,,,,,,,,,,0,,,,,S,sols,,,148,-1.015427,46.662234
2021-1453039,2021-02-04,000001,Vente,150000,,,VILDE,B925,85110,85051,Chantonnay,85,,,850510000O1104,,,,,,,,,,,,,0,,,,,S,sols,,,348,-1.01564,46.662179
2021-1453039,2021-02-04,000001,Vente,150000,,,VILDE,B925,85110,85051,Chantonnay,85,,,850510000O1106,,,,,,,,,,,,,0,,,,,T,terres,,,61,-1.015797,46.662058
2021-1453044,2021-01-29,000001,Vente,143000,126,,AV DE LATTRE DE TASSIGNY,0258,85110,85051,Chantonnay,85,,,850510000B1432,,,,,,,,,,,,,0,1,Maison,75,5,S,sols,,,942,-1.033311,46.683839
2021-1453049,2021-02-05,000002,Vente,275000,64,A,L ORMEAU,B581,85110,85051,Chantonnay,85,,,85051000ZP0151,,,,,,,,,,,,,0,1,Maison,120,4,S,sols,,,2083,-0.998767,46.649239
2021-1453049,2021-02-05,000002,Vente,275000,,,L ORMEAU,B581,85110,85051,Chantonnay,85,,,85051000ZP0154,,,,,,,,,,,,,0,,,,,T,terres,,,215,-0.999045,46.649093
2021-1453049,2021-02-05,000002,Vente,275000,,,L ORMEAU,B581,85110,85051,Chantonnay,85,,,85051000ZP0156,,,,,,,,,,,,,0,,,,,P,prés,,,320,-0.999028,46.648931
2021-1453103,2021-01-29,000001,Vente,120000,4386,,ZI PIERRE BRUNE,B995,85110,85051,Chantonnay,85,,,85051000AH0026,,,,,,,,,,,,,0,4,Local industriel. commercial ou assimilé,600,0,S,sols,,,1534,-1.039745,46.69755
2021-1453189,2021-02-09,000001,Vente,42000,2,,RUE BELLIARD,0060,85110,85051,Chantonnay,85,,,85051000BC0079,,,,,,,,,,,,,0,1,Maison,68,3,S,sols,,,105,-1.045936,46.689976
2021-1453189,2021-02-09,000001,Vente,42000,,,RUE D ALSACE,0040,85110,85051,Chantonnay,85,,,85051000BC0103,,,,,,,,,,,,,0,,,,,S,sols,,,24,-1.045799,46.689885
2021-1453189,2021-02-09,000001,Vente,42000,,,RUE D ALSACE,0040,85110,85051,Chantonnay,85,,,85051000BC0103,,,,,,,,,,,,,0,,,,,S,sols,,,24,-1.045799,46.689885
2021-1453189,2021-02-09,000001,Vente,42000,,,RUE D ALSACE,0040,85110,85051,Chantonnay,85,,,85051000BC0103,,,,,,,,,,,,,0,,,,,S,sols,,,24,-1.045799,46.689885
2021-1453189,2021-02-09,000001,Vente,42000,,,RUE D ALSACE,0040,85110,85051,Chantonnay,85,,,85051000BC0103,,,,,,,,,,,,,0,,,,,S,sols,,,25,-1.045799,46.689885
2021-1453189,2021-02-09,000001,Vente,42000,,,RUE D ALSACE,0040,85110,85051,Chantonnay,85,,,85051000BC0103,,,,,,,,,,,,,0,,,,,S,sols,,,25,-1.045799,46.689885
2021-1453189,2021-02-09,000001,Vente,42000,,,RUE D ALSACE,0040,85110,85051,Chantonnay,85,,,85051000BC0103,,,,,,,,,,,,,0,,,,,S,sols,,,24,-1.045799,46.689885
2021-1453189,2021-02-09,000001,Vente,42000,,,RUE D ALSACE,0040,85110,85051,Chantonnay,85,,,85051000BC0103,,,,,,,,,,,,,0,,,,,S,sols,,,24,-1.045799,46.689885
2021-1453234,2021-02-12,000001,Vente,40000,,,IMP BENJAMIN BOUQUET,0076,85110,85051,Chantonnay,85,,,85051000BE0242,,,,,,,,,,,,,0,,,,,S,sols,,,185,-1.049153,46.685808
2021-1453234,2021-02-12,000001,Vente,40000,2,,IMP BENJAMIN BOUQUET,0076,85110,85051,Chantonnay,85,,,85051000BE0243,,,,,,,,,,,,,0,1,Maison,65,3,S,sols,,,157,-1.049276,46.685765
2021-1453234,2021-02-12,000001,Vente,40000,,,IMP BENJAMIN BOUQUET,0076,85110,85051,Chantonnay,85,,,85051000BE0249,,,,,,,,,,,,,0,,,,,S,sols,,,213,-1.048908,46.685508
2021-1453235,2021-02-10,000001,Vente,33300,,,LE BOURG SAINT MARS DES PR,B085,85110,85051,Chantonnay,85,,,850510000M1233,,,,,,,,,,,,,0,,,,,T,terres,,,930,-1.003131,46.68177
2021-1453235,2021-02-10,000001,Vente,33300,,,RUE D' ETHIOPIE,0290,85110,85051,Chantonnay,85,,,850510000M1585,,,,,,,,,,,,,0,,,,,T,terres,,,65,-1.00298,46.681736
2021-1453235,2021-02-10,000001,Vente,33300,,,RUE D' ETHIOPIE,0290,85110,85051,Chantonnay,85,,,850510000M1589,,,,,,,,,,,,,0,,,,,T,terres,,,140,-1.003209,46.681815
2021-1453235,2021-02-10,000001,Vente,33300,,,RUE D' ETHIOPIE,0290,85110,85051,Chantonnay,85,,,850510000M1594,,,,,,,,,,,,,0,,,,,T,terres,,,19,-1.002956,46.681939
2021-1453238,2021-02-16,000001,Vente terrain à bâtir,37345.5,,,LES BOUALES,B077,85110,85051,Chantonnay,85,,,85051000AO0067,,,,,,,,,,,,,0,,,,,AB,terrains a bâtir,,,645,-1.059778,46.692326
2021-1453239,2021-02-12,000001,Vente,54000,17,,RUE DU GENERAL MARCE,0410,85110,85051,Chantonnay,85,,,850510000S0065,,,,,,,,,,,,,0,1,Maison,90,4,S,sols,,,142,-0.992327,46.656438
2021-1453239,2021-02-12,000001,Vente,54000,23,,RUE DU GENERAL MARCE,0410,85110,85051,Chantonnay,85,,,850510000S1240,,,,,,,,,,,,,0,3,Dépendance,,0,S,sols,,,145,-0.992535,46.656212
2021-1453239,2021-02-12,000001,Vente,54000,17,,RUE DU GENERAL MARCE,0410,85110,85051,Chantonnay,85,,,850510000S1242,,,,,,,,,,,,,0,3,Dépendance,,0,S,sols,,,61,-0.992325,46.656526
2021-1453241,2021-02-15,000001,Vente,30000,20,,RUE DE LA TUILERIE,0990,85110,85051,Chantonnay,85,,,85051000BC0141,,,,,,,,,,,,,0,3,Dépendance,,0,S,sols,,,690,-1.042779,46.693521
2021-1453243,2021-02-15,000001,Vente terrain à bâtir,23000,,,LES MARZELLES,B531,85110,85051,Chantonnay,85,,,85051000XV0122,,,,,,,,,,,,,0,,,,,AB,terrains a bâtir,,,425,-1.037262,46.683885
2021-1453244,2021-02-15,000001,Vente terrain à bâtir,32500,20,,RUE DES CHANTERELLES,0146,85110,85051,Chantonnay,85,,,85051000AI0206,,,,,,,,,,,,,0,,,,,AB,terrains a bâtir,,,412,-1.057631,46.701478
2021-1453246,2021-02-11,000001,Vente terrain à bâtir,42500,18,,RUE DES CHANTERELLES,0146,85110,85051,Chantonnay,85,,,85051000AI0205,,,,,,,,,,,,,0,,,,,AB,terrains a bâtir,,,563,-1.057791,46.701516
2021-1453247,2021-02-11,000001,Vente terrain à bâtir,22500,19,,RUE DES PLANTES,0866,85110,85051,Chantonnay,85,,,85051000XV0140,,,,,,,,,,,,,0,,,,,AB,terrains a bâtir,,,420,-1.037437,46.682243
2021-1453339,2021-02-17,000001,Vente terrain à bâtir,35800,23,,RUE DES CHANTERELLES,0146,85110,85051,Chantonnay,85,,,85051000AI0188,,,,,,,,,,,,,0,,,,,AB,terrains a bâtir,,,476,-1.057575,46.702178
2021-1453347,2021-02-26,000001,Vente terrain à bâtir,28500,11,,RUE DES CHANTERELLES,0146,85110,85051,Chantonnay,85,,,85051000AI0177,,,,,,,,,,,,,0,,,,,AB,terrains a bâtir,,,332,-1.058626,46.701872
2021-1453356,2021-02-19,000001,Vente,1000,,,LA PIERRE FOLLE,B681,85110,85051,Chantonnay,85,,,85051000ZM0039,,,,,,,,,,,,,0,,,,,T,terres,,,2000,-0.973348,46.665522
2021-1453356,2021-02-19,000001,Vente,1000,,,LA PIERRE FOLLE,B681,85110,85051,Chantonnay,85,,,85051000ZM0039,,,,,,,,,,,,,0,,,,,T,terres,,,2000,-0.973348,46.665522
2021-1453362,2021-02-26,000001,Vente,75000,5,,PL LAZARE CARNOT,0580,85110,85051,Chantonnay,85,,,85051000BE0170,,,,,,,,,,,,,0,1,Maison,84,4,S,sols,,,156,-1.047819,46.686314
2021-1453441,2021-03-01,000001,Vente,155000,10,,IMP DES ROSIERS,0922,85110,85051,Chantonnay,85,,,85051000AV0061,,,,,,,,,,,,,0,1,Maison,101,4,AG,terrains d'agrément,,,849,-1.061854,46.684269
2021-1453441,2021-03-01,000001,Vente,155000,10,,IMP DES ROSIERS,0922,85110,85051,Chantonnay,85,,,85051000AV0061,,,,,,,,,,,,,0,1,Maison,101,4,S,sols,,,500,-1.061854,46.684269
2021-1453512,2021-03-01,000001,Vente,188500,59,,RUE DE LA MICHELIERE,0745,85110,85051,Chantonnay,85,,,85051000AZ0001,,,,,,,,,,,,,0,1,Maison,168,5,J,jardins,,,6715,-1.060691,46.676915
2021-1453512,2021-03-01,000001,Vente,188500,59,,RUE DE LA MICHELIERE,0745,85110,85051,Chantonnay,85,,,85051000AZ0001,,,,,,,,,,,,,0,1,Maison,168,5,S,sols,,,1500,-1.060691,46.676915
2021-1453611,2021-03-02,000001,Vente,84000,4151,,LA BOBINIERE,B043,85110,85051,Chantonnay,85,,,85051000XM0084,,,,,,,,,,,,,0,1,Maison,132,7,T,terres,,,4500,-0.991143,46.690656
2021-1453611,2021-03-02,000001,Vente,84000,4151,,LA BOBINIERE,B043,85110,85051,Chantonnay,85,,,85051000XM0084,,,,,,,,,,,,,0,1,Maison,132,7,S,sols,,,500,-0.991143,46.690656
2021-1453613,2021-02-26,000001,Vente,700,,,FIEF DES BRUERES,B359,85110,85051,Chantonnay,85,,,85051000WV0020,,,,,,,,,,,,,0,,,,,T,terres,,,2863,-1.073953,46.683564
2021-1453642,2021-03-11,000001,Vente,75000,,,LA ROCHE,B845,85110,85051,Chantonnay,85,,,850510000M0996,,,,,,,,,,,,,0,,,,,J,jardins,,,180,-0.992857,46.674043
2021-1453642,2021-03-11,000001,Vente,75000,9,,RUE DE LA ROCHE SAINT MARS,0903,85110,85051,Chantonnay,85,,,850510000M1026,,,,,,,,,,,,,0,1,Maison,53,2,S,sols,,,540,-0.9938,46.67465
2021-1453642,2021-03-11,000001,Vente,75000,,,LA ROCHE,B845,85110,85051,Chantonnay,85,,,850510000M1027,,,,,,,,,,,,,0,,,,,S,sols,,,35,-0.993625,46.674621
2021-1453642,2021-03-11,000001,Vente,75000,,,LA ROCHE,B845,85110,85051,Chantonnay,85,,,850510000M1410,,,,,,,,,,,,,0,,,,,J,jardins,,,80,-0.993009,46.673981
2021-1453642,2021-03-11,000001,Vente,75000,,,LA ROCHE,B845,85110,85051,Chantonnay,85,,,850510000M1558,,,,,,,,,,,,,0,,,,,J,jardins,,,165,-0.992718,46.674459
2021-1453642,2021-03-11,000001,Vente,75000,,,LA ROCHE,B845,85110,85051,Chantonnay,85,,,85051000XR0057,,,,,,,,,,,,,0,,,,,T,terres,,,7380,-0.994458,46.676349
2021-1453798,2021-03-11,000001,Vente,300000,15,,PL DE LA LIBERTE,0584,85110,85051,Chantonnay,85,,,85051000BE0329,,,7,344.21,,,,,,,,,1,4,Local industriel. commercial ou assimilé,400,0,,,,,,-1.050727,46.687912
2021-1453798,2021-03-11,000001,Vente,300000,15,,PL DE LA LIBERTE,0584,85110,85051,Chantonnay,85,,,85051000BE0329,,,7,344.21,,,,,,,,,1,4,Local industriel. commercial ou assimilé,216,0,,,,,,-1.050727,46.687912
2021-1453841,2021-03-15,000001,Vente,39000,,,LE PIQUERET,B684,85110,85051,Chantonnay,85,,,85051000AT0242,,,,,,,,,,,,,0,,,,,AB,terrains a bâtir,,,555,-1.060534,46.688267
2021-1453844,2021-03-17,000001,Vente,67000,19,,AV DE LATTRE DE TASSIGNY,0258,85110,85051,Chantonnay,85,,,85051000BE0218,,,16,,47,,,,,,,,2,2,Appartement,69,3,,,,,,-1.047968,46.685353
2021-1453844,2021-03-17,000001,Vente,67000,19,,AV DE LATTRE DE TASSIGNY,0258,85110,85051,Chantonnay,85,,,85051000BE0218,,,69,,,,,,,,,,1,3,Dépendance,,0,,,,,,-1.047968,46.685353
2021-1453846,2021-03-18,000002,Vente,1000,3,,PL DU CHEVALIER ADAMS,0172,85110,85051,Chantonnay,85,,,85051000AC0330,,,,,,,,,,,,,0,,,,,S,sols,,,10,-1.029943,46.707327
2021-1453897,2021-03-19,000001,Vente,55000,,,RUE DES DAMES,0250,85110,85051,Chantonnay,85,,,85051000AC0042,,,,,,,,,,,,,0,,,,,J,jardins,,,143,-1.030308,46.707012
2021-1453897,2021-03-19,000001,Vente,55000,3,,PL DU CHEVALIER ADAMS,0172,85110,85051,Chantonnay,85,,,85051000AC0329,,,,,,,,,,,,,0,,,,,S,sols,,,513,-1.030093,46.707233
2021-1453900,2021-03-19,000001,Vente,142500,,,LE GROS BOIS,B473,85110,85051,Chantonnay,85,,,85051000YB0035,,,,,,,,,,,,,0,,,,,T,terres,,,1160,-1.048789,46.64909
2021-1453900,2021-03-19,000001,Vente,142500,6,,RUE DU POISERIT,0869,85110,85051,Chantonnay,85,,,85051000YB0230,,,,,,,,,,,,,0,1,Maison,97,3,S,sols,,,927,-1.048507,46.648678
2021-1453900,2021-03-19,000001,Vente,142500,,,LE POISERIT,B721,85110,85051,Chantonnay,85,,,85051000YB0231,,,,,,,,,,,,,0,,,,,S,sols,,,47,-1.048702,46.64852
2021-1453900,2021-03-19,000001,Vente,142500,,,LE POISERIT,B721,85110,85051,Chantonnay,85,,,85051000YB0399,,,,,,,,,,,,,0,,,,,P,prés,,,533,-1.048541,46.648463
2021-1453905,2021-03-19,000001,Vente,190000,132,,RUE DES BARETTES,0049,85110,85051,Chantonnay,85,,,85051000AR0013,,,,,,,,,,,,,0,1,Maison,94,4,S,sols,,,500,-1.065609,46.690026
2021-1453905,2021-03-19,000001,Vente,190000,132,,RUE DES BARETTES,0049,85110,85051,Chantonnay,85,,,85051000AR0013,,,,,,,,,,,,,0,1,Maison,94,4,AG,terrains d'agrément,,,1559,-1.065609,46.690026
2021-1453905,2021-03-19,000001,Vente,190000,132,,RUE DES BARETTES,0049,85110,85051,Chantonnay,85,,,85051000AR0013,,,,,,,,,,,,,0,1,Maison,94,4,VI,vignes,,,897,-1.065609,46.690026
2021-1453912,2021-03-25,000001,Vente,290000,15,,AV DE LA MINE,0753,85110,85051,Chantonnay,85,,,85051000BN0031,,,,,,,,,,,,,0,1,Maison,137,4,AG,terrains d'agrément,SPORT,Terrain de sport,1489,-1.048674,46.677403
2021-1453912,2021-03-25,000001,Vente,290000,15,,AV DE LA MINE,0753,85110,85051,Chantonnay,85,,,85051000BN0031,,,,,,,,,,,,,0,1,Maison,137,4,S,sols,,,500,-1.048674,46.677403
2021-1453913,2021-03-25,000001,Vente,145000,7,,AV HENRI ROCHEREAU,0450,85110,85051,Chantonnay,85,,,85051000BA0240,,,,,,,,,,,,,0,1,Maison,119,4,AG,terrains d'agrément,,,1154,-1.053446,46.689283
2021-1453913,2021-03-25,000001,Vente,145000,7,,AV HENRI ROCHEREAU,0450,85110,85051,Chantonnay,85,,,85051000BA0240,,,,,,,,,,,,,0,1,Maison,119,4,S,sols,,,500,-1.053446,46.689283
2021-1453925,2021-03-03,000001,Vente,126500,26,,LA CHAUVETIERE,B247,85110,85051,Chantonnay,85,,,85051000AB0007,,,,,,,,,,,,,0,1,Maison,90,5,S,sols,,,944,-1.033672,46.710999
2021-1453969,2021-03-18,000001,Vente,183000,,,LE FUITEAU,B410,85110,85051,Chantonnay,85,,,850510000E0258,,,,,,,,,,,,,0,,,,,J,jardins,,,241,-1.074978,46.648024
2021-1453969,2021-03-18,000001,Vente,183000,,,LE FUITEAU,B410,85110,85051,Chantonnay,85,,,850510000E0892,,,,,,,,,,,,,0,,,,,J,jardins,,,216,-1.07491,46.648007
2021-1453969,2021-03-18,000001,Vente,183000,,,LE FUITEAU,B410,85110,85051,Chantonnay,85,,,850510000E0893,,,,,,,,,,,,,0,,,,,J,jardins,,,282,-1.074813,46.647961
2021-1453969,2021-03-18,000001,Vente,183000,,,LE FUITEAU,B410,85110,85051,Chantonnay,85,,,850510000E0894,,,,,,,,,,,,,0,,,,,S,sols,,,123,-1.074855,46.647846
2021-1453969,2021-03-18,000001,Vente,183000,54,,RUE DU FUITEAU,0330,85110,85051,Chantonnay,85,,,850510000E0895,,,,,,,,,,,,,0,1,Maison,132,4,S,sols,,,155,-1.074762,46.647859
2021-1453969,2021-03-18,000001,Vente,183000,,,LE FUITEAU,B410,85110,85051,Chantonnay,85,,,850510000E1014,,,,,,,,,,,,,0,,,,,S,sols,,,60,-1.074594,46.64785
2021-1453969,2021-03-18,000001,Vente,183000,,,LE FUITEAU,B410,85110,85051,Chantonnay,85,,,850510000E1198,,,,,,,,,,,,,0,,,,,S,sols,,,117,-1.074683,46.647821
2021-1453969,2021-03-18,000001,Vente,183000,,,LE FUITEAU,B410,85110,85051,Chantonnay,85,,,850510000E1199,,,,,,,,,,,,,0,,,,,S,sols,,,74,-1.074656,46.647758
2021-1453969,2021-03-18,000001,Vente,183000,,,LES FRERES,B406,85110,85051,Chantonnay,85,,,850510000E1200,,,,,,,,,,,,,0,,,,,T,terres,,,219,-1.074811,46.648171
2021-1453969,2021-03-18,000001,Vente,183000,,,LES FRERES,B406,85110,85051,Chantonnay,85,,,850510000E1202,,,,,,,,,,,,,0,,,,,T,terres,,,988,-1.074538,46.647989
2021-1453972,2021-03-17,000001,Vente,3498,,,TENEMENT DES BOIS RAYES,B883,85110,85051,Chantonnay,85,,,85051000YE0122,,,,,,,,,,,,,0,,,,,T,terres,,,9290,-1.018168,46.647441
2021-1453972,2021-03-17,000001,Vente,3498,,,LE FIEF PATEAUD,B388,85110,85051,Chantonnay,85,,,85051000ZX0027,,,,,,,,,,,,,0,,,,,VI,vignes,,,530,-1.008884,46.642349
2021-1453972,2021-03-17,000001,Vente,3498,,,LE FIEF PATEAUD,B388,85110,85051,Chantonnay,85,,,85051000ZX0027,,,,,,,,,,,,,0,,,,,T,terres,,,2210,-1.008884,46.642349
2021-1453973,2021-03-17,000002,Vente,3963,,,LES GRANDS AFFIAGES,B955,85110,85051,Chantonnay,85,,,85051000ZR0007,,,,,,,,,,,,,0,,,,,T,terres,,,4080,-1.00374,46.645523
2021-1453973,2021-03-17,000002,Vente,3963,,,LES GRANDS AFFIAGES,B955,85110,85051,Chantonnay,85,,,85051000ZR0008,,,,,,,,,,,,,0,,,,,T,terres,,,2660,-1.00424,46.645281
2021-1453973,2021-03-17,000002,Vente,3963,,,LES GRANDS AFFIAGES,B955,85110,85051,Chantonnay,85,,,85051000ZR0009,,,,,,,,,,,,,0,,,,,T,terres,,,3340,-1.004797,46.645054
2021-1453973,2021-03-17,000002,Vente,3963,,,LES GRANDS AFFIAGES,B955,85110,85051,Chantonnay,85,,,85051000ZR0019,,,,,,,,,,,,,0,,,,,T,terres,,,5820,-1.005322,46.644579
2021-1453975,2021-03-29,000001,Vente,202000,1,,RUE DE LA CROIX,0242,85110,85051,Chantonnay,85,,,85051000AC0250,,,,,,,,,,,,,0,1,Maison,106,7,S,sols,,,1110,-1.034591,46.705292
2021-1453981,2021-03-29,000001,Vente,14762.5,,,LA PIARDIERE,B672,85110,85051,Chantonnay,85,,,85051000ZM0022,,,,,,,,,,,,,0,,,,,P,prés,,,6315,-0.975217,46.671095
2021-1453981,2021-03-29,000001,Vente,14762.5,,,LA PIARDIERE,B672,85110,85051,Chantonnay,85,,,85051000ZM0022,,,,,,,,,,,,,0,,,,,P,prés,,,18945,-0.975217,46.671095
2021-1453981,2021-03-29,000001,Vente,14762.5,,,LA PIERRE FOLLE,B681,85110,85051,Chantonnay,85,,,85051000ZM0050,,,,,,,,,,,,,0,,,,,T,terres,,,22527,-0.973957,46.666636
2021-1453981,2021-03-29,000001,Vente,14762.5,,,LA PIERRE FOLLE,B681,85110,85051,Chantonnay,85,,,85051000ZM0050,,,,,,,,,,,,,0,,,,,T,terres,,,11263,-0.973957,46.666636
2021-1454056,2021-03-19,000001,Vente,134000,1,,RUE DES GABARDIERES,0331,85110,85051,Chantonnay,85,,,85051000YN0041,,,,,,,,,,,,,0,1,Maison,100,4,J,jardins,,,984,-1.017267,46.671076
2021-1454056,2021-03-19,000001,Vente,134000,1,,RUE DES GABARDIERES,0331,85110,85051,Chantonnay,85,,,85051000YN0041,,,,,,,,,,,,,0,1,Maison,100,4,S,sols,,,500,-1.017267,46.671076
2021-1454056,2021-03-19,000001,Vente,134000,1,,RUE DES GABARDIERES,0331,85110,85051,Chantonnay,85,,,85051000YN0041,,,,,,,,,,,,,0,1,Maison,100,4,S,sols,,,16,-1.017267,46.671076
2021-1454058,2021-03-31,000001,Vente,124000,19,,AV DE LA MINE,0753,85110,85051,Chantonnay,85,,,85051000BN0034,,,,,,,,,,,,,0,1,Maison,62,4,S,sols,,,500,,
2021-1454058,2021-03-31,000001,Vente,124000,19,,AV DE LA MINE,0753,85110,85051,Chantonnay,85,,,85051000BN0034,,,,,,,,,,,,,0,1,Maison,62,4,J,jardins,,,1171,,
2021-1454058,2021-03-31,000001,Vente,124000,19,,AV DE LA MINE,0753,85110,85051,Chantonnay,85,,,85051000BN0034,,,,,,,,,,,,,0,1,Maison,62,4,J,jardins,,,1171,,
2021-1454058,2021-03-31,000001,Vente,124000,19,,AV DE LA MINE,0753,85110,85051,Chantonnay,85,,,85051000BN0034,,,,,,,,,,,,,0,1,Maison,62,4,S,sols,,,500,,
2021-1454060,2021-03-31,000001,Vente,180000,21,,AV HENRI ROCHEREAU,0450,85110,85051,Chantonnay,85,,,85051000BA0247,,,,,,,,,,,,,0,1,Maison,130,6,S,sols,,,695,-1.053694,46.688681
2021-1454062,2021-03-30,000001,Vente,135000,6,,IMP DE L HOTEL DU NORD,0471,85110,85051,Chantonnay,85,,,850510000S1280,,,,,,,,,,,,,0,1,Maison,89,4,S,sols,,,90,-0.991319,46.656824
2021-1454062,2021-03-30,000001,Vente,135000,,,LE BOURG,B083,85110,85051,Chantonnay,85,,,850510000S1286,,,,,,,,,,,,,0,,,,,S,sols,,,48,-0.991383,46.656743
2021-1454062,2021-03-30,000001,Vente,135000,,,LE BOURG,B083,85110,85051,Chantonnay,85,,,850510000S1294,,,,,,,,,,,,,0,,,,,S,sols,,,36,-0.991417,46.656662
2021-1454062,2021-03-30,000001,Vente,135000,,,FIEF DU GAS,B985,85110,85051,Chantonnay,85,,,85051000ZP0011,,,,,,,,,,,,,0,,,,,T,terres,,,410,-0.989206,46.655687
2021-1454074,2021-03-31,000001,Vente,390000,5,,AV HENRI ROCHEREAU,0450,85110,85051,Chantonnay,85,,,85051000BA0300,,,,,,,,,,,,,0,1,Maison,233,7,S,sols,,,548,-1.05329,46.68954
2021-1454122,2021-03-25,000001,Vente terrain à bâtir,51000,,,LA NOUE,B573,85110,85051,Chantonnay,85,,,85051000AT0203,,,,,,,,,,,,,0,,,,,AB,terrains a bâtir,,,801,-1.060144,46.687042
2021-1454202,2021-04-02,000001,Vente,228000,14,,RUE BEETHOVEN,1054,85110,85051,Chantonnay,85,,,85051000AY0122,,,,,,,,,,,,,0,1,Maison,94,4,S,sols,,,673,-1.057827,46.679296
2021-1454212,2021-04-08,000001,Vente terrain à bâtir,39500,24,,RUE DES CHANTERELLES,0146,85110,85051,Chantonnay,85,,,85051000AI0208,,,,,,,,,,,,,0,,,,,AB,terrains a bâtir,,,519,-1.057156,46.701505
2021-1454227,2021-04-02,000002,Vente,130000,15,,RUE DE LA MARZELLE,0725,85110,85051,Chantonnay,85,,,850510000I0044,,,,,,,,,,,,,0,1,Maison,81,4,P,prés,,,828,-1.085311,46.704181
2021-1454227,2021-04-02,000002,Vente,130000,15,,RUE DE LA MARZELLE,0725,85110,85051,Chantonnay,85,,,850510000I0503,,,,,,,,,,,,,0,3,Dépendance,,0,S,sols,,,629,-1.085427,46.704486
2021-1454243,2021-03-19,000001,Vente,136640.47,16,,RUE DES PRUNELLES,0879,85110,85051,Chantonnay,85,,,85051000XS0088,,,,,,,,,,,,,0,1,Maison,75,3,S,sols,,,682,-1.005667,46.684505
2021-1454253,2021-04-12,000001,Vente,220000,9001,,RUE ALEXANDRE ROCHEREAU,0020,85110,85051,Chantonnay,85,,,85051000AN0054,,,,,,,,,,,,,0,1,Maison,106,4,S,sols,,,1006,-1.052855,46.69288
2021-1454255,2021-04-08,000001,Vente,1368,,,RUE DE LA MARZELLE,0725,85110,85051,Chantonnay,85,,,850510000I0504,,,,,,,,,,,,,0,,,,,S,sols,,,228,-1.085129,46.704614