id_mutation,date_mutation,numero_disposition,nature_mutation,valeur_fonciere,adresse_numero,adresse_suffixe,adresse_nom_voie,adresse_code_voie,code_postal,code_commune,nom_commune,code_departement,ancien_code_commune,ancien_nom_commune,id_parcelle,ancien_id_parcelle,numero_volume,lot1_numero,lot1_surface_carrez,lot2_numero,lot2_surface_carrez,lot3_numero,lot3_surface_carrez,lot4_numero,lot4_surface_carrez,lot5_numero,lot5_surface_carrez,nombre_lots,code_type_local,type_local,surface_reelle_bati,nombre_pieces_principales,code_nature_culture,nature_culture,code_nature_culture_speciale,nature_culture_speciale,surface_terrain,longitude,latitude
2021-1481564,2021-02-22,000001,Vente,123000,10,,RTE DE SAINT-GERVAIS,0045,86230,86127,Leigné-sur-Usseau,86,,,861270000D0841,,,,,,,,,,,,,0,1,Maison,83,4,J,jardins,,,575,0.469006,46.912778
2021-1481564,2021-02-22,000001,Vente,123000,10,,RTE DE SAINT-GERVAIS,0045,86230,86127,Leigné-sur-Usseau,86,,,861270000D0841,,,,,,,,,,,,,0,1,Maison,83,4,S,sols,,,422,0.469006,46.912778
2021-1483011,2021-03-19,000001,Vente,3600,,,LA LOGE,B069,86230,86127,Leigné-sur-Usseau,86,,,86127000ZI0034,,,,,,,,,,,,,0,,,,,T,terres,,,9000,0.464354,46.908645
2021-1484086,2021-05-05,000001,Vente,3500,,,LA GERBAUDIERE,B055,86230,86127,Leigné-sur-Usseau,86,,,861270000A0212,,,,,,,,,,,,,0,,,,,BR,futaies résineuses,,,910,0.471601,46.9316
2021-1484666,2021-05-25,000001,Vente,81000,6,,RTE D'USSEAU,0050,86230,86127,Leigné-sur-Usseau,86,,,861270000D0425,,,,,,,,,,,,,0,1,Maison,100,4,S,sols,,,790,0.471911,46.912697
2021-1484666,2021-05-25,000001,Vente,81000,6,,RTE D'USSEAU,0050,86230,86127,Leigné-sur-Usseau,86,,,861270000D0425,,,,,,,,,,,,,0,3,Dépendance,,0,S,sols,,,790,0.471911,46.912697
2021-1485558,2021-06-16,000001,Vente,1000,,,LE CHATEAU FORT,B037,86230,86127,Leigné-sur-Usseau,86,,,86127000ZE0121,,,,,,,,,,,,,0,,,,,J,jardins,,,593,0.485413,46.903
2021-1485559,2021-06-16,000002,Vente,44000,9,,LE CHATEAU FORT,B037,86230,86127,Leigné-sur-Usseau,86,,,86127000ZE0123,,,,,,,,,,,,,0,1,Maison,64,2,S,sols,,,605,0.485611,46.903125
2021-1485559,2021-06-16,000002,Vente,44000,,,LE CHATEAU FORT,B037,86230,86127,Leigné-sur-Usseau,86,,,86127000ZE0125,,,,,,,,,,,,,0,,,,,T,terres,,,120,0.485789,46.90322
2021-1485559,2021-06-16,000002,Vente,44000,,,LE CHATEAU FORT,B037,86230,86127,Leigné-sur-Usseau,86,,,86127000ZE0128,,,,,,,,,,,,,0,,,,,S,sols,,,8,0.48563,46.903243
2021-1487313,2021-07-30,000001,Vente,240000,,,VENISE,B091,86230,86127,Leigné-sur-Usseau,86,,,86127000ZK0011,,,,,,,,,,,,,0,,,,,T,terres,,,7540,0.458845,46.913639
2021-1487313,2021-07-30,000001,Vente,240000,5042,,VENISE,B091,86230,86127,Leigné-sur-Usseau,86,,,86127000ZK0117,,,,,,,,,,,,,0,3,Dépendance,,0,S,sols,,,585,0.458296,46.913521
2021-1487313,2021-07-30,000001,Vente,240000,5042,,VENISE,B091,86230,86127,Leigné-sur-Usseau,86,,,86127000ZK0117,,,,,,,,,,,,,0,1,Maison,178,5,S,sols,,,585,0.458296,46.913521
2021-1487313,2021-07-30,000001,Vente,240000,5042,,VENISE,B091,86230,86127,Leigné-sur-Usseau,86,,,86127000ZK0117,,,,,,,,,,,,,0,3,Dépendance,,0,S,sols,,,585,0.458296,46.913521
2021-1487313,2021-07-30,000001,Vente,240000,5042,,VENISE,B091,86230,86127,Leigné-sur-Usseau,86,,,86127000ZK0117,,,,,,,,,,,,,0,3,Dépendance,,0,S,sols,,,585,0.458296,46.913521
2021-1488153,2021-08-25,000001,Vente,85000,2,,PL DE L'EGLISE,0015,86230,86127,Leigné-sur-Usseau,86,,,861270000D0806,,,,,,,,,,,,,0,3,Dépendance,,0,S,sols,,,178,0.472319,46.913264
2021-1488153,2021-08-25,000001,Vente,85000,2,,PL DE L'EGLISE,0015,86230,86127,Leigné-sur-Usseau,86,,,861270000D0806,,,,,,,,,,,,,0,3,Dépendance,,0,S,sols,,,178,0.472319,46.913264
2021-1488153,2021-08-25,000001,Vente,85000,2,,PL DE L'EGLISE,0015,86230,86127,Leigné-sur-Usseau,86,,,861270000D0806,,,,,,,,,,,,,0,1,Maison,105,5,S,sols,,,178,0.472319,46.913264
2021-1488153,2021-08-25,000001,Vente,85000,,,LE BOURG,B024,86230,86127,Leigné-sur-Usseau,86,,,861270000D0807,,,,,,,,,,,,,0,,,,,S,sols,,,103,0.472503,46.913329
2021-1488153,2021-08-25,000001,Vente,85000,,,CHAMPS DU CIMETIERE,B035,86230,86127,Leigné-sur-Usseau,86,,,86127000ZD0046,,,,,,,,,,,,,0,,,,,T,terres,,,500,0.474605,46.913288
2021-1488943,2021-09-13,000001,Vente,29424,,,LA PINAUDIERE,B080,86230,86127,Leigné-sur-Usseau,86,,,86127000ZA0004,,,,,,,,,,,,,0,,,,,T,terres,,,10720,0.478382,46.928624
2021-1488943,2021-09-13,000001,Vente,29424,,,LA PINAUDIERE,B080,86230,86127,Leigné-sur-Usseau,86,,,86127000ZA0004,,,,,,,,,,,,,0,,,,,T,terres,,,6300,0.478382,46.928624
2021-1488943,2021-09-13,000001,Vente,29424,,,LA PINAUDIERE,B080,86230,86127,Leigné-sur-Usseau,86,,,86127000ZA0004,,,,,,,,,,,,,0,,,,,T,terres,,,25220,0.478382,46.928624
2021-1488943,2021-09-13,000001,Vente,29424,,,LA PINAUDIERE,B080,86230,86127,Leigné-sur-Usseau,86,,,86127000ZA0004,,,,,,,,,,,,,0,,,,,VI,vignes,,,3720,0.478382,46.928624
2021-1488943,2021-09-13,000001,Vente,29424,,,CHAMPS DU CERISIER,B034,86230,86127,Leigné-sur-Usseau,86,,,86127000ZA0043,,,,,,,,,,,,,0,,,,,T,terres,,,9300,0.472559,46.929634
2021-1488943,2021-09-13,000001,Vente,29424,,,CHAMPS DU CERISIER,B034,86230,86127,Leigné-sur-Usseau,86,,,86127000ZA0043,,,,,,,,,,,,,0,,,,,T,terres,,,9290,0.472559,46.929634
2021-1488943,2021-09-13,000001,Vente,29424,,,LES VOIES,B094,86230,86127,Leigné-sur-Usseau,86,,,86127000ZB0006,,,,,,,,,,,,,0,,,,,T,terres,,,16050,0.482918,46.921103
2021-1488943,2021-09-13,000001,Vente,29424,,,LES VOIES,B094,86230,86127,Leigné-sur-Usseau,86,,,86127000ZB0007,,,,,,,,,,,,,0,,,,,T,terres,,,1940,0.483536,46.921641
2021-1488943,2021-09-13,000001,Vente,29424,,,LA HAUTE POUBLAIE,B067,86230,86127,Leigné-sur-Usseau,86,,,86127000ZM0041,,,,,,,,,,,,,0,,,,,T,terres,,,2080,0.464228,46.930878
2021-1488943,2021-09-13,000001,Vente,29424,,,LA HAUTE POUBLAIE,B067,86230,86127,Leigné-sur-Usseau,86,,,86127000ZM0042,,,,,,,,,,,,,0,,,,,T,terres,,,3260,0.464645,46.930817
2021-1488943,2021-09-13,000001,Vente,29424,,,LA HAUTE POUBLAIE,B067,86230,86127,Leigné-sur-Usseau,86,,,86127000ZM0048,,,,,,,,,,,,,0,,,,,T,terres,,,6310,0.466559,46.930411
2021-1488943,2021-09-13,000001,Vente,29424,,,LA HAUTE POUBLAIE,B067,86230,86127,Leigné-sur-Usseau,86,,,86127000ZM0049,,,,,,,,,,,,,0,,,,,T,terres,,,3890,0.467081,46.930631
2021-1489775,2021-09-16,000001,Vente,3000,,,LE CHILLOUX FERRE,B040,86230,86127,Leigné-sur-Usseau,86,,,861270000D0282,,,,,,,,,,,,,0,,,,,BR,futaies résineuses,,,14800,0.456749,46.908099
2021-1489955,2021-09-20,000001,Vente,100000,18,,RUE DU CHILLOU FERRE,0010,86230,86127,Leigné-sur-Usseau,86,,,861270000D0731,,,,,,,,,,,,,0,3,Dépendance,,0,S,sols,,,600,0.459524,46.909192
2021-1489955,2021-09-20,000001,Vente,100000,18,,RUE DU CHILLOU FERRE,0010,86230,86127,Leigné-sur-Usseau,86,,,861270000D0731,,,,,,,,,,,,,0,1,Maison,90,4,J,jardins,,,1215,0.459524,46.909192
2021-1489955,2021-09-20,000001,Vente,100000,18,,RUE DU CHILLOU FERRE,0010,86230,86127,Leigné-sur-Usseau,86,,,861270000D0731,,,,,,,,,,,,,0,3,Dépendance,,0,J,jardins,,,1215,0.459524,46.909192
2021-1489955,2021-09-20,000001,Vente,100000,18,,RUE DU CHILLOU FERRE,0010,86230,86127,Leigné-sur-Usseau,86,,,861270000D0731,,,,,,,,,,,,,0,1,Maison,90,4,S,sols,,,600,0.459524,46.909192
2021-1489955,2021-09-20,000001,Vente,100000,,,PIECES DE LA BAILLERIE,B077,86230,86127,Leigné-sur-Usseau,86,,,861270000D0732,,,,,,,,,,,,,0,,,,,T,terres,,,3585,0.458992,46.909614
2021-1489955,2021-09-20,000001,Vente,100000,,,PIECES DE LA BAILLERIE,B077,86230,86127,Leigné-sur-Usseau,86,,,861270000D0733,,,,,,,,,,,,,0,,,,,T,terres,,,93,0.459418,46.909129
2021-1490214,2021-10-01,000001,Vente,32000,8,,ORIGNY,B073,86230,86127,Leigné-sur-Usseau,86,,,86127000ZD0028,,,,,,,,,,,,,0,3,Dépendance,,0,AG,terrains d'agrément,,,2910,0.483312,46.912498
2021-1490216,2021-10-01,000001,Vente,1,,,ORIGNY,B073,86230,86127,Leigné-sur-Usseau,86,,,86127000ZD0024,,,,,,,,,,,,,0,,,,,T,terres,,,110,0.484474,46.911916
2021-1490433,2021-10-01,000001,Vente,90000,4,,PL DE L'EGLISE,0015,86230,86127,Leigné-sur-Usseau,86,,,861270000D0584,,,,,,,,,,,,,0,3,Dépendance,,0,S,sols,,,226,0.472146,46.91332
2021-1490433,2021-10-01,000001,Vente,90000,4,,PL DE L'EGLISE,0015,86230,86127,Leigné-sur-Usseau,86,,,861270000D0584,,,,,,,,,,,,,0,1,Maison,85,4,S,sols,,,226,0.472146,46.91332
2021-1490433,2021-10-01,000001,Vente,90000,,,LE BOURG,B024,86230,86127,Leigné-sur-Usseau,86,,,861270000D0807,,,,,,,,,,,,,0,,,,,S,sols,,,103,0.472503,46.913329
2021-1491111,2021-11-03,000001,Vente,40000,,,LA GROTTE A GALIPEAU,B064,86230,86127,Leigné-sur-Usseau,86,,,861270000D0089,,,,,,,,,,,,,0,,,,,BT,taillis simples,,,250,0.452121,46.913987
2021-1491434,2021-11-15,000001,Vente,105000,,,LE BOURG,B024,86230,86127,Leigné-sur-Usseau,86,,,861270000D0419,,,,,,,,,,,,,0,,,,,S,sols,,,395,0.471399,46.913139
2021-1491434,2021-11-15,000001,Vente,105000,2,,RTE DE SAINT-GERVAIS,0045,86230,86127,Leigné-sur-Usseau,86,,,861270000D0531,,,,,,,,,,,,,0,3,Dépendance,,0,S,sols,,,255,0.471684,46.913155
2021-1491434,2021-11-15,000001,Vente,105000,2,,RTE DE SAINT-GERVAIS,0045,86230,86127,Leigné-sur-Usseau,86,,,861270000D0531,,,,,,,,,,,,,0,1,Maison,113,4,S,sols,,,255,0.471684,46.913155
2021-1491434,2021-11-15,000001,Vente,105000,2,,RTE DE SAINT-GERVAIS,0045,86230,86127,Leigné-sur-Usseau,86,,,861270000D0531,,,,,,,,,,,,,0,3,Dépendance,,0,S,sols,,,255,0.471684,46.913155
2021-1491525,2021-10-26,000001,Vente,15500,,,LE BOURG,B024,86230,86127,Leigné-sur-Usseau,86,,,861270000D0426,,,,,,,,,,,,,0,,,,,J,jardins,,,480,0.471799,46.912373
2021-1491525,2021-10-26,000001,Vente,15500,,,LE BOURG,B024,86230,86127,Leigné-sur-Usseau,86,,,861270000D0526,,,,,,,,,,,,,0,,,,,J,jardins,,,160,0.471799,46.912481
2021-1491525,2021-10-26,000001,Vente,15500,,,LE BOURG,B024,86230,86127,Leigné-sur-Usseau,86,,,861270000D0863,,,,,,,,,,,,,0,,,,,J,jardins,,,182,0.471629,46.912539
2021-1492230,2021-11-24,000001,Vente,62000,,,LES VOIES,B094,86230,86127,Leigné-sur-Usseau,86,,,86127000ZC0020,,,,,,,,,,,,,0,,,,,T,terres,,,760,0.483577,46.920533
2021-1492230,2021-11-24,000001,Vente,62000,2,,LES VOIES,B094,86230,86127,Leigné-sur-Usseau,86,,,86127000ZC0021,,,,,,,,,,,,,0,1,Maison,100,3,S,sols,,,2570,0.484094,46.92089
2021-1493018,2021-12-21,000001,Vente,167000,9,,RTE DE VAUX,0055,86230,86127,Leigné-sur-Usseau,86,,,86127000ZD0042,,,,,,,,,,,,,0,1,Maison,123,6,S,sols,,,800,0.474791,46.912684
2021-1493018,2021-12-21,000001,Vente,167000,9,,RTE DE VAUX,0055,86230,86127,Leigné-sur-Usseau,86,,,86127000ZD0042,,,,,,,,,,,,,0,1,Maison,123,6,AG,terrains d'agrément,,,3680,0.474791,46.912684
