id_mutation,date_mutation,numero_disposition,nature_mutation,valeur_fonciere,adresse_numero,adresse_suffixe,adresse_nom_voie,adresse_code_voie,code_postal,code_commune,nom_commune,code_departement,ancien_code_commune,ancien_nom_commune,id_parcelle,ancien_id_parcelle,numero_volume,lot1_numero,lot1_surface_carrez,lot2_numero,lot2_surface_carrez,lot3_numero,lot3_surface_carrez,lot4_numero,lot4_surface_carrez,lot5_numero,lot5_surface_carrez,nombre_lots,code_type_local,type_local,surface_reelle_bati,nombre_pieces_principales,code_nature_culture,nature_culture,code_nature_culture_speciale,nature_culture_speciale,surface_terrain,longitude,latitude
2021-1485736,2021-06-22,000001,Vente,23188,1,,RUE DE LA MAIRIE,0170,86150,86176,Nérignac,86,,,861760000A0538,,,,,,,,,,,,,0,3,Dépendance,,0,S,sols,,,336,0.727352,46.294971
2021-1485736,2021-06-22,000001,Vente,23188,1,,RUE DE LA MAIRIE,0170,86150,86176,Nérignac,86,,,861760000A0538,,,,,,,,,,,,,0,1,Maison,100,3,S,sols,,,336,0.727352,46.294971
2021-1491807,2021-11-18,000001,Vente,800,,,LE BOURG,B006,86150,86176,Nérignac,86,,,861760000A0535,,,,,,,,,,,,,0,,,,,S,sols,,,25,0.727223,46.295063
2021-1492160,2021-11-25,000001,Vente,166000,,,COMMUNAL DU BERGERON,B015,86150,86176,Nérignac,86,,,861760000A0137,,,,,,,,,,,,,0,,,,,T,terres,,,2036,0.732236,46.296429
2021-1492160,2021-11-25,000001,Vente,166000,,,COMMUNAL DU BERGERON,B015,86150,86176,Nérignac,86,,,861760000A0138,,,,,,,,,,,,,0,,,,,J,jardins,,,2219,0.731603,46.29625
2021-1492160,2021-11-25,000001,Vente,166000,,,COMMUNAL DU BERGERON,B015,86150,86176,Nérignac,86,,,861760000A0139,,,,,,,,,,,,,0,,,,,P,prés,,,6530,0.731504,46.2967
2021-1492160,2021-11-25,000001,Vente,166000,,,LE BERGERON,B003,86150,86176,Nérignac,86,,,861760000A0228,,,,,,,,,,,,,0,,,,,P,prés,,,3084,0.730734,46.296658
2021-1492160,2021-11-25,000001,Vente,166000,21,,RUE DE LA MAIRIE,0170,86150,86176,Nérignac,86,,,861760000A0234,,,,,,,,,,,,,0,3,Dépendance,,0,S,sols,,,1244,0.731131,46.2961
2021-1492160,2021-11-25,000001,Vente,166000,21,,RUE DE LA MAIRIE,0170,86150,86176,Nérignac,86,,,861760000A0234,,,,,,,,,,,,,0,3,Dépendance,,0,S,sols,,,1244,0.731131,46.2961
2021-1492160,2021-11-25,000001,Vente,166000,21,,RUE DE LA MAIRIE,0170,86150,86176,Nérignac,86,,,861760000A0234,,,,,,,,,,,,,0,3,Dépendance,,0,S,sols,,,1244,0.731131,46.2961
2021-1492160,2021-11-25,000001,Vente,166000,21,,RUE DE LA MAIRIE,0170,86150,86176,Nérignac,86,,,861760000A0234,,,,,,,,,,,,,0,3,Dépendance,,0,S,sols,,,1244,0.731131,46.2961
2021-1492160,2021-11-25,000001,Vente,166000,21,,RUE DE LA MAIRIE,0170,86150,86176,Nérignac,86,,,861760000A0234,,,,,,,,,,,,,0,1,Maison,147,6,S,sols,,,1244,0.731131,46.2961
