id_mutation,date_mutation,numero_disposition,nature_mutation,valeur_fonciere,adresse_numero,adresse_suffixe,adresse_nom_voie,adresse_code_voie,code_postal,code_commune,nom_commune,code_departement,ancien_code_commune,ancien_nom_commune,id_parcelle,ancien_id_parcelle,numero_volume,lot1_numero,lot1_surface_carrez,lot2_numero,lot2_surface_carrez,lot3_numero,lot3_surface_carrez,lot4_numero,lot4_surface_carrez,lot5_numero,lot5_surface_carrez,nombre_lots,code_type_local,type_local,surface_reelle_bati,nombre_pieces_principales,code_nature_culture,nature_culture,code_nature_culture_speciale,nature_culture_speciale,surface_terrain,longitude,latitude
2021-1480431,2021-01-12,000001,Vente,450,,,LES TERRIERS,B039,86120,86196,Pouançay,86,,,86196000ZD0026,,,,,,,,,,,,,0,,,,,T,terres,,,860,-0.080854,47.079905
2021-1480465,2021-01-12,000001,Vente,200,,,LES TERRIERS,B039,86120,86196,Pouançay,86,,,86196000ZD0027,,,,,,,,,,,,,0,,,,,T,terres,,,290,-0.080933,47.079578
2021-1480964,2021-01-28,000001,Vente,190000,5,,RUE DES PECTENS,0370,86120,86196,Pouançay,86,,,86196000ZA0228,,,,,,,,,,,,,0,1,Maison,103,4,J,jardins,,,925,-0.085456,47.094353
2021-1480964,2021-01-28,000001,Vente,190000,5,,RUE DES PECTENS,0370,86120,86196,Pouançay,86,,,86196000ZA0228,,,,,,,,,,,,,0,1,Maison,103,4,S,sols,,,500,-0.085456,47.094353
2021-1482929,2021-03-26,000001,Vente,280000,2,,ALL DU JARDIN SECRET,0230,86120,86196,Pouançay,86,,,86196000AD0219,,,,,,,,,,,,,0,1,Maison,290,7,S,sols,,,693,-0.071662,47.080135
2021-1483037,2021-04-07,000001,Vente,1000,,,MARAIS GUILLAUME,B025,86120,86196,Pouançay,86,,,86196000ZC0458,,,,,,,,,,,,,0,,,,,BP,peupleraies,,,3551,-0.100407,47.08602
2021-1485629,2021-05-27,000001,Vente,133000,18,,RUE DU MOULIN BLANC,0310,86120,86196,Pouançay,86,,,86196000ZA0130,,,,,,,,,,,,,0,1,Maison,144,5,S,sols,,,864,-0.083762,47.095649
2021-1485629,2021-05-27,000001,Vente,133000,18,,RUE DU MOULIN BLANC,0310,86120,86196,Pouançay,86,,,86196000ZA0130,,,,,,,,,,,,,0,3,Dépendance,,0,S,sols,,,864,-0.083762,47.095649
2021-1485629,2021-05-27,000001,Vente,133000,,,LES TERRES DE LENAY,B038,86120,86196,Pouançay,86,,,86196000ZA0172,,,,,,,,,,,,,0,,,,,AG,terrains d'agrément,,,627,-0.083682,47.095897
2021-1485629,2021-05-27,000001,Vente,133000,,,LES TERRES DE LENAY,B038,86120,86196,Pouançay,86,,,86196000ZA0172,,,,,,,,,,,,,0,,,,,S,sols,,,200,-0.083682,47.095897
2021-1485629,2021-05-27,000001,Vente,133000,,,LES TERRES DE LENAY,B038,86120,86196,Pouançay,86,,,86196000ZA0174,,,,,,,,,,,,,0,,,,,S,sols,,,150,-0.083958,47.095709
2021-1485629,2021-05-27,000001,Vente,133000,,,LES TERRES DE LENAY,B038,86120,86196,Pouançay,86,,,86196000ZA0408,,,,,,,,,,,,,0,,,,,T,terres,,,1404,-0.082493,47.095263
2021-1485629,2021-05-27,000001,Vente,133000,,,LES TERRES DE LENAY,B038,86120,86196,Pouançay,86,,,86196000ZA0410,,,,,,,,,,,,,0,,,,,L,landes,,,1621,-0.082454,47.095303
2021-1486483,2021-05-11,000001,Vente,50000,,,POUANCAY,B032,86120,86196,Pouançay,86,,,86196000AD0457,,,,,,,,,,,,,0,,,,,S,sols,,,110,-0.073468,47.079763
2021-1486483,2021-05-11,000001,Vente,50000,19,,RUE JEANNE OGERON,0250,86120,86196,Pouançay,86,,,86196000AD0459,,,,,,,,,,,,,0,1,Maison,96,4,S,sols,,,440,-0.073303,47.079704
2021-1486483,2021-05-11,000001,Vente,50000,19,,RUE JEANNE OGERON,0250,86120,86196,Pouançay,86,,,86196000AD0459,,,,,,,,,,,,,0,3,Dépendance,,0,S,sols,,,440,-0.073303,47.079704
2021-1487213,2021-07-29,000001,Vente,1000,,,BARBEREUX,B004,86120,86196,Pouançay,86,,,86196000ZD0190,,,,,,,,,,,,,0,,,,,BT,taillis simples,,,216,-0.070826,47.076272
2021-1487682,2021-07-20,000001,Vente,279770,,,LA MOTTE BOURBON,B027,86120,86196,Pouançay,86,,,86196000AB0035,,,,,,,,,,,,,0,,,,,P,prés,MARAI,Pré marais,1245,-0.08956,47.096721
2021-1487682,2021-07-20,000001,Vente,279770,,,LA MOTTE BOURBON,B027,86120,86196,Pouançay,86,,,86196000AB0036,,,,,,,,,,,,,0,,,,,S,sols,,,445,-0.089442,47.096651
2021-1487682,2021-07-20,000001,Vente,279770,,,LA MOTTE BOURBON,B027,86120,86196,Pouançay,86,,,86196000AB0038,,,,,,,,,,,,,0,,,,,J,jardins,,,4165,-0.088743,47.096553
2021-1487682,2021-07-20,000001,Vente,279770,,,LA MOTTE BOURBON,B027,86120,86196,Pouançay,86,,,86196000AB0074,,,,,,,,,,,,,0,,,,,S,sols,,,117,-0.088927,47.096536
2021-1487682,2021-07-20,000001,Vente,279770,,,LA MOTTE BOURBON,B027,86120,86196,Pouançay,86,,,86196000AB0075,,,,,,,,,,,,,0,,,,,S,sols,,,6,-0.088642,47.096713
2021-1487682,2021-07-20,000001,Vente,279770,1,,RUE DU MOULIN BLANC,0310,86120,86196,Pouançay,86,,,86196000AB0076,,,,,,,,,,,,,0,1,Maison,90,3,S,sols,,,1579,-0.0891,47.096637
2021-1487682,2021-07-20,000001,Vente,279770,1,,RUE DU MOULIN BLANC,0310,86120,86196,Pouançay,86,,,86196000AB0076,,,,,,,,,,,,,0,3,Dépendance,,0,S,sols,,,1579,-0.0891,47.096637
2021-1487682,2021-07-20,000001,Vente,279770,1,,RUE DU MOULIN BLANC,0310,86120,86196,Pouançay,86,,,86196000AB0076,,,,,,,,,,,,,0,1,Maison,166,5,S,sols,,,1579,-0.0891,47.096637
2021-1487683,2021-07-20,000002,Vente,165230,,,LA MOTTE BOURBON,B027,86120,86196,Pouançay,86,,,86196000AB0032,,,,,,,,,,,,,0,,,,,T,terres,,,9437,-0.089673,47.095776
2021-1487683,2021-07-20,000002,Vente,165230,,,LA MOTTE BOURBON,B027,86120,86196,Pouançay,86,,,86196000AB0033,,,,,,,,,,,,,0,,,,,S,sols,,,3955,-0.089973,47.096254
2021-1487683,2021-07-20,000002,Vente,165230,,,LA MOTTE BOURBON,B027,86120,86196,Pouançay,86,,,86196000AB0034,,,,,,,,,,,,,0,,,,,J,jardins,,,752,-0.090104,47.096387
2021-1488576,2021-08-12,000001,Vente,45000,5140,,LE NOIREAU,B028,86120,86196,Pouançay,86,,,86196000ZA0451,,,,,,,,,,,,,0,4,Local industriel. commercial ou assimilé,400,0,S,sols,,,3517,-0.083604,47.0949
2021-1488615,2021-08-12,000001,Vente,33750,5140,,LE NOIREAU,B028,86120,86196,Pouançay,86,,,86196000ZA0451,,,,,,,,,,,,,0,4,Local industriel. commercial ou assimilé,400,0,S,sols,,,3517,-0.083604,47.0949
2021-1490418,2021-09-23,000001,Vente,48000,1,,RUE DU CLOS BASSET,0030,86120,86196,Pouançay,86,,,86196000AD0204,,,,,,,,,,,,,0,1,Maison,57,3,S,sols,,,670,-0.071722,47.080324
2021-1490418,2021-09-23,000001,Vente,48000,1,,RUE DU CLOS BASSET,0030,86120,86196,Pouançay,86,,,86196000AD0204,,,,,,,,,,,,,0,3,Dépendance,,0,S,sols,,,670,-0.071722,47.080324
2021-1490845,2021-10-26,000001,Vente,2500,,,LES FRICHES LONGS,B020,86120,86196,Pouançay,86,,,86196000ZE0013,,,,,,,,,,,,,0,,,,,T,terres,,,15934,-0.074293,47.093438
2021-1491097,2021-10-12,000001,Vente,155000,3,,RUE DU CLOS BASSET,0030,86120,86196,Pouançay,86,,,86196000AD0205,,,,,,,,,,,,,0,3,Dépendance,,0,S,sols,,,913,-0.071316,47.080351
2021-1491097,2021-10-12,000001,Vente,155000,3,,RUE DU CLOS BASSET,0030,86120,86196,Pouançay,86,,,86196000AD0205,,,,,,,,,,,,,0,3,Dépendance,,0,S,sols,,,913,-0.071316,47.080351
2021-1491097,2021-10-12,000001,Vente,155000,3,,RUE DU CLOS BASSET,0030,86120,86196,Pouançay,86,,,86196000AD0205,,,,,,,,,,,,,0,1,Maison,169,7,S,sols,,,913,-0.071316,47.080351
2021-1491097,2021-10-12,000001,Vente,155000,,,POUANCAY,B032,86120,86196,Pouançay,86,,,86196000AD0206,,,,,,,,,,,,,0,,,,,J,jardins,,,116,-0.071312,47.08014
2021-1491097,2021-10-12,000001,Vente,155000,,,POUANCAY,B032,86120,86196,Pouançay,86,,,86196000AD0207,,,,,,,,,,,,,0,,,,,S,sols,,,220,-0.07127,47.080124
2021-1491097,2021-10-12,000001,Vente,155000,,,POUANCAY,B032,86120,86196,Pouançay,86,,,86196000AD0208,,,,,,,,,,,,,0,,,,,S,sols,,,305,-0.071127,47.080265
2021-1491097,2021-10-12,000001,Vente,155000,,,POUANCAY,B032,86120,86196,Pouançay,86,,,86196000AD0213,,,,,,,,,,,,,0,,,,,J,jardins,,,1095,-0.070873,47.079937
2021-1491097,2021-10-12,000001,Vente,155000,,,POUANCAY,B032,86120,86196,Pouançay,86,,,86196000AD0215,,,,,,,,,,,,,0,,,,,S,sols,,,283,-0.071039,47.079952
