id_mutation,date_mutation,numero_disposition,nature_mutation,valeur_fonciere,adresse_numero,adresse_suffixe,adresse_nom_voie,adresse_code_voie,code_postal,code_commune,nom_commune,code_departement,ancien_code_commune,ancien_nom_commune,id_parcelle,ancien_id_parcelle,numero_volume,lot1_numero,lot1_surface_carrez,lot2_numero,lot2_surface_carrez,lot3_numero,lot3_surface_carrez,lot4_numero,lot4_surface_carrez,lot5_numero,lot5_surface_carrez,nombre_lots,code_type_local,type_local,surface_reelle_bati,nombre_pieces_principales,code_nature_culture,nature_culture,code_nature_culture_speciale,nature_culture_speciale,surface_terrain,longitude,latitude
2021-1480371,2021-01-08,000001,Vente,30000,,,LES PERCHES,B131,86400,86237,Saint-Pierre-d'Exideuil,86,,,862370000E0761,,,,,,,,,,,,,0,,,,,J,jardins,,,925,0.260878,46.148201
2021-1480371,2021-01-08,000001,Vente,30000,,,LES PERCHES,B131,86400,86237,Saint-Pierre-d'Exideuil,86,,,862370000E0761,,,,,,,,,,,,,0,,,,,S,sols,,,505,0.260878,46.148201
2021-1480371,2021-01-08,000001,Vente,30000,,,LES PERCHES,B131,86400,86237,Saint-Pierre-d'Exideuil,86,,,862370000E0761,,,,,,,,,,,,,0,,,,,J,jardins,,,1540,0.260878,46.148201
2021-1480519,2021-01-21,000001,Vente,12300,,,LES GRANDES VERSANNES,B105,86400,86237,Saint-Pierre-d'Exideuil,86,,,86237000ZM0087,,,,,,,,,,,,,0,,,,,AB,terrains a bâtir,,,615,0.267141,46.151654
2021-1480803,2021-01-08,000001,Vente,407232,,,LE POTEAU,B149,86400,86237,Saint-Pierre-d'Exideuil,86,,,862370000C0507,,,,,,,,,,,,,0,,,,,CH,chemin de fer,,,2088,0.284935,46.149721
2021-1480803,2021-01-08,000001,Vente,407232,,,LA GARE,B094,86400,86237,Saint-Pierre-d'Exideuil,86,,,862370000C0766,,,,,,,,,,,,,0,,,,,S,sols,,,27,0.281664,46.149812
2021-1480803,2021-01-08,000001,Vente,407232,,,LA GARE,B094,86400,86237,Saint-Pierre-d'Exideuil,86,,,862370000C0768,,,,,,,,,,,,,0,,,,,S,sols,,,2320,0.281884,46.149683
2021-1480803,2021-01-08,000001,Vente,407232,5001,,ALL DES PINS,0012,86400,86237,Saint-Pierre-d'Exideuil,86,,,862370000C0909,,,,,,,,,,,,,0,4,Local industriel. commercial ou assimilé,,0,S,sols,,,162,0.283487,46.149075
2021-1480803,2021-01-08,000001,Vente,407232,,,LA GARE,B094,86400,86237,Saint-Pierre-d'Exideuil,86,,,862370000C0910,,,,,,,,,,,,,0,,,,,S,sols,,,165,0.283468,46.148948
2021-1480803,2021-01-08,000001,Vente,407232,,,LA GARE,B094,86400,86237,Saint-Pierre-d'Exideuil,86,,,862370000C0911,,,,,,,,,,,,,0,,,,,S,sols,,,459,0.283521,46.149022
2021-1480803,2021-01-08,000001,Vente,407232,,,LA GARE,B094,86400,86237,Saint-Pierre-d'Exideuil,86,,,862370000C0912,,,,,,,,,,,,,0,,,,,S,sols,,,255,0.283268,46.149115
2021-1480803,2021-01-08,000001,Vente,407232,,,LA GARE,B094,86400,86237,Saint-Pierre-d'Exideuil,86,,,862370000C0913,,,,,,,,,,,,,0,,,,,S,sols,,,260,0.28325,46.148988
2021-1480803,2021-01-08,000001,Vente,407232,,,LA GARE,B094,86400,86237,Saint-Pierre-d'Exideuil,86,,,862370000C0914,,,,,,,,,,,,,0,,,,,S,sols,,,238,0.283282,46.149219
2021-1480803,2021-01-08,000001,Vente,407232,,,LA GARE,B094,86400,86237,Saint-Pierre-d'Exideuil,86,,,862370000C0915,,,,,,,,,,,,,0,,,,,S,sols,,,41,0.283258,46.149043
2021-1480803,2021-01-08,000001,Vente,407232,,,LA GARE,B094,86400,86237,Saint-Pierre-d'Exideuil,86,,,862370000C0916,,,,,,,,,,,,,0,,,,,S,sols,,,98,0.283239,46.148905
2021-1480803,2021-01-08,000001,Vente,407232,,,LA GARE,B094,86400,86237,Saint-Pierre-d'Exideuil,86,,,862370000C0917,,,,,,,,,,,,,0,,,,,S,sols,,,197,0.283082,46.14913
2021-1480803,2021-01-08,000001,Vente,407232,,,LA GARE,B094,86400,86237,Saint-Pierre-d'Exideuil,86,,,862370000C0918,,,,,,,,,,,,,0,,,,,S,sols,,,205,0.283064,46.149004
2021-1480803,2021-01-08,000001,Vente,407232,,,LA GARE,B094,86400,86237,Saint-Pierre-d'Exideuil,86,,,862370000C0919,,,,,,,,,,,,,0,,,,,S,sols,,,607,0.283012,46.14903
2021-1480803,2021-01-08,000001,Vente,407232,20,,RUE NORBERT PORTEJOIE,0010,86400,86237,Saint-Pierre-d'Exideuil,86,,,862370000C0920,,,,,,,,,,,,,0,4,Local industriel. commercial ou assimilé,,,S,sols,,,4538,0.283431,46.149514
2021-1480803,2021-01-08,000001,Vente,407232,20,,RUE NORBERT PORTEJOIE,0010,86400,86237,Saint-Pierre-d'Exideuil,86,,,862370000C0921,,,,,,,,,,,,,0,,,,,S,sols,,,4305,0.283751,46.149548
2021-1480803,2021-01-08,000001,Vente,407232,,,LES ELBES,B083,86400,86237,Saint-Pierre-d'Exideuil,86,,,86237000ZK0034,,,,,,,,,,,,,0,,,,,S,sols,,,169,0.283129,46.151028
2021-1480803,2021-01-08,000001,Vente,407232,5001,F,LES ELBES,B083,86400,86237,Saint-Pierre-d'Exideuil,86,,,86237000ZK0039,,,,,,,,,,,,,0,4,Local industriel. commercial ou assimilé,,,S,sols,,,42104,0.282298,46.150521
2021-1480803,2021-01-08,000001,Vente,407232,,,LES ELBES,B083,86400,86237,Saint-Pierre-d'Exideuil,86,,,86237000ZK0040,,,,,,,,,,,,,0,,,,,S,sols,,,938,0.279708,46.150606
2021-1480803,2021-01-08,000001,Vente,407232,,,LES ELBES,B083,86400,86237,Saint-Pierre-d'Exideuil,86,,,86237000ZK0105,,,,,,,,,,,,,0,,,,,AB,terrains a bâtir,,,2100,0.283521,46.151763
2021-1480803,2021-01-08,000001,Vente,407232,,,LES ELBES,B083,86400,86237,Saint-Pierre-d'Exideuil,86,,,86237000ZK0110,,,,,,,,,,,,,0,,,,,AB,terrains a bâtir,,,14681,0.284504,46.151521
2021-1480803,2021-01-08,000001,Vente,407232,9001,F,L EPINETTE,B085,86400,86237,Saint-Pierre-d'Exideuil,86,,,86237000ZL0046,,,,,,,,,,,,,0,4,Local industriel. commercial ou assimilé,,,S,sols,,,16570,0.261889,46.155041
2021-1480966,2021-02-04,000001,Vente,19000,,,DALIDANT,B077,86400,86237,Saint-Pierre-d'Exideuil,86,,,862370000E0492,,,,,,,,,,,,,0,,,,,P,prés,,,1025,0.263847,46.144355
2021-1480966,2021-02-04,000001,Vente,19000,,,DALIDANT,B077,86400,86237,Saint-Pierre-d'Exideuil,86,,,862370000E0493,,,,,,,,,,,,,0,,,,,P,prés,,,1930,0.263652,46.144065
2021-1480966,2021-02-04,000001,Vente,19000,,,DALIDANT,B077,86400,86237,Saint-Pierre-d'Exideuil,86,,,862370000E0494,,,,,,,,,,,,,0,,,,,J,jardins,,,365,0.263878,46.144083
2021-1480966,2021-02-04,000001,Vente,19000,5221,,DALIDANT,B077,86400,86237,Saint-Pierre-d'Exideuil,86,,,862370000E0774,,,,,,,,,,,,,0,1,Maison,75,2,S,sols,,,253,0.263866,46.143954
2021-1483428,2021-04-15,000001,Vente,110000,,,LE BOURG,B034,86400,86237,Saint-Pierre-d'Exideuil,86,,,862370000C0326,,,,,,,,,,,,,0,,,,,J,jardins,,,1320,0.269644,46.152479
2021-1483428,2021-04-15,000001,Vente,110000,8,,RTE DE CHAUNAY,0020,86400,86237,Saint-Pierre-d'Exideuil,86,,,862370000C0327,,,,,,,,,,,,,0,1,Maison,88,3,S,sols,,,210,0.269214,46.152513
2021-1483428,2021-04-15,000001,Vente,110000,8,,RTE DE CHAUNAY,0020,86400,86237,Saint-Pierre-d'Exideuil,86,,,862370000C0327,,,,,,,,,,,,,0,3,Dépendance,,0,S,sols,,,210,0.269214,46.152513
2021-1483484,2021-04-06,000001,Vente,34403,,,LA BESSANTE,B006,86400,86237,Saint-Pierre-d'Exideuil,86,,,86237000ZA0023,,,,,,,,,,,,,0,,,,,CA,carrières,,,2475,0.229064,46.171459
2021-1483484,2021-04-06,000001,Vente,34403,,,LA BESSANTE,B006,86400,86237,Saint-Pierre-d'Exideuil,86,,,86237000ZA0025,,,,,,,,,,,,,0,,,,,T,terres,,,6877,0.229203,46.1724
2021-1484037,2021-04-26,000001,Vente,5000,,,LE MOULIN MINOT,B122,86400,86237,Saint-Pierre-d'Exideuil,86,,,862370000C0643,,,,,,,,,,,,,0,,,,,J,jardins,,,645,0.276633,46.14711
2021-1485763,2021-06-17,000001,Vente,12300,,,LES GRANDES VERSANNES,B105,86400,86237,Saint-Pierre-d'Exideuil,86,,,86237000ZM0073,,,,,,,,,,,,,0,,,,,AB,terrains a bâtir,,,406,0.266617,46.152365
2021-1485763,2021-06-17,000001,Vente,12300,,,LES GRANDES VERSANNES,B105,86400,86237,Saint-Pierre-d'Exideuil,86,,,86237000ZM0079,,,,,,,,,,,,,0,,,,,AB,terrains a bâtir,,,414,0.266774,46.152169
2021-1486065,2021-06-23,000001,Vente,37500,35,,RUE NORBERT PORTEJOIE,0010,86400,86237,Saint-Pierre-d'Exideuil,86,,,862370000C0555,,,,,,,,,,,,,0,1,Maison,72,6,S,sols,,,304,0.284334,46.149086
2021-1486065,2021-06-23,000001,Vente,37500,,,LA GARE,B094,86400,86237,Saint-Pierre-d'Exideuil,86,,,862370000C0557,,,,,,,,,,,,,0,,,,,S,sols,,,100,0.284406,46.148995
2021-1486078,2021-06-21,000001,Vente,4500,,,LA BONNARDELIERE,B028,86400,86237,Saint-Pierre-d'Exideuil,86,,,862370000B0945,,,,,,,,,,,,,0,,,,,T,terres,,,10091,0.242594,46.170702
2021-1487028,2021-07-19,000001,Vente,150000,23,,RTE DE NIORT,0120,86400,86237,Saint-Pierre-d'Exideuil,86,,,862370000E0944,,,,,,,,,,,,,0,1,Maison,90,5,S,sols,,,1000,0.265007,46.149776
2021-1487028,2021-07-19,000001,Vente,150000,23,,RTE DE NIORT,0120,86400,86237,Saint-Pierre-d'Exideuil,86,,,862370000E0944,,,,,,,,,,,,,0,3,Dépendance,,0,S,sols,,,1000,0.265007,46.149776
2021-1487028,2021-07-19,000001,Vente,150000,23,,RTE DE NIORT,0120,86400,86237,Saint-Pierre-d'Exideuil,86,,,862370000E0944,,,,,,,,,,,,,0,3,Dépendance,,0,S,sols,,,1000,0.265007,46.149776
2021-1487028,2021-07-19,000001,Vente,150000,23,,RTE DE NIORT,0120,86400,86237,Saint-Pierre-d'Exideuil,86,,,862370000E0944,,,,,,,,,,,,,0,1,Maison,90,5,P,prés,,,2287,0.265007,46.149776
2021-1487028,2021-07-19,000001,Vente,150000,23,,RTE DE NIORT,0120,86400,86237,Saint-Pierre-d'Exideuil,86,,,862370000E0944,,,,,,,,,,,,,0,3,Dépendance,,0,P,prés,,,2287,0.265007,46.149776
2021-1487028,2021-07-19,000001,Vente,150000,23,,RTE DE NIORT,0120,86400,86237,Saint-Pierre-d'Exideuil,86,,,862370000E0944,,,,,,,,,,,,,0,3,Dépendance,,0,P,prés,,,2287,0.265007,46.149776
2021-1487445,2021-07-30,000001,Vente,143000,9,,LE PETIT BREUIL,B132,86400,86237,Saint-Pierre-d'Exideuil,86,,,86237000ZI0032,,,,,,,,,,,,,0,1,Maison,138,4,J,jardins,,,1000,0.279649,46.161507
2021-1487445,2021-07-30,000001,Vente,143000,9,,LE PETIT BREUIL,B132,86400,86237,Saint-Pierre-d'Exideuil,86,,,86237000ZI0032,,,,,,,,,,,,,0,1,Maison,138,4,S,sols,,,500,0.279649,46.161507
2021-1487481,2021-07-20,000001,Vente,73000,,,MARIGNE,B119,86400,86237,Saint-Pierre-d'Exideuil,86,,,86237000ZE0090,,,,,,,,,,,,,0,,,,,J,jardins,,,1431,0.275465,46.176676
2021-1487805,2021-08-09,000001,Vente,44000,5061,,LA GARE,B094,86400,86237,Saint-Pierre-d'Exideuil,86,,,862370000C0550,,,,,,,,,,,,,0,1,Maison,90,4,S,sols,,,677,0.28268,46.148943
2021-1490392,2021-09-29,000001,Vente,86000,28,,RUE NORBERT PORTEJOIE,0010,86400,86237,Saint-Pierre-d'Exideuil,86,,,862370000C0612,,,,,,,,,,,,,0,3,Dépendance,,0,S,sols,,,1294,0.279227,46.150143
2021-1490392,2021-09-29,000001,Vente,86000,28,,RUE NORBERT PORTEJOIE,0010,86400,86237,Saint-Pierre-d'Exideuil,86,,,862370000C0612,,,,,,,,,,,,,0,1,Maison,99,5,S,sols,,,1294,0.279227,46.150143
2021-1491186,2021-10-27,000001,Vente,14520,,,LES GRANDES VERSANNES,B105,86400,86237,Saint-Pierre-d'Exideuil,86,,,86237000ZM0082,,,,,,,,,,,,,0,,,,,AB,terrains a bâtir,,,726,0.267764,46.152396
2021-1492433,2021-11-24,000001,Vente,79000,2,,RTE DE NIORT,0120,86400,86237,Saint-Pierre-d'Exideuil,86,,,862370000C0410,,,,,,,,,,,,,0,3,Dépendance,,0,S,sols,,,519,0.269574,46.150408
2021-1492433,2021-11-24,000001,Vente,79000,2,,RTE DE NIORT,0120,86400,86237,Saint-Pierre-d'Exideuil,86,,,862370000C0410,,,,,,,,,,,,,0,1,Maison,116,4,S,sols,,,519,0.269574,46.150408
2021-1492500,2021-12-07,000001,Vente,15000,,,LE GRAND PLOMB,B101,86400,86237,Saint-Pierre-d'Exideuil,86,,,862370000B0393,,,,,,,,,,,,,0,,,,,T,terres,,,4280,0.248486,46.167386
2021-1492500,2021-12-07,000001,Vente,15000,,,LE GRAND PLOMB,B101,86400,86237,Saint-Pierre-d'Exideuil,86,,,862370000B0394,,,,,,,,,,,,,0,,,,,T,terres,,,750,0.248871,46.167252
2021-1492500,2021-12-07,000001,Vente,15000,,,LE GRAND PLOMB,B101,86400,86237,Saint-Pierre-d'Exideuil,86,,,862370000B0395,,,,,,,,,,,,,0,,,,,T,terres,,,2910,0.249108,46.167082
2021-1492500,2021-12-07,000001,Vente,15000,5150,,LE GRAND PLOMB,B101,86400,86237,Saint-Pierre-d'Exideuil,86,,,862370000B0396,,,,,,,,,,,,,0,1,Maison,80,2,S,sols,,,1880,0.248648,46.167211
2021-1493314,2021-12-21,000001,Vente,150000,5391,F,DALIDANT,B077,86400,86237,Saint-Pierre-d'Exideuil,86,,,862370000E0498,,,,,,,,,,,,,0,3,Dépendance,,0,S,sols,,,500,0.263473,46.143292
2021-1493314,2021-12-21,000001,Vente,150000,5391,F,DALIDANT,B077,86400,86237,Saint-Pierre-d'Exideuil,86,,,862370000E0498,,,,,,,,,,,,,0,1,Maison,117,4,S,sols,,,500,0.263473,46.143292
2021-1493314,2021-12-21,000001,Vente,150000,5391,F,DALIDANT,B077,86400,86237,Saint-Pierre-d'Exideuil,86,,,862370000E0498,,,,,,,,,,,,,0,3,Dépendance,,0,AG,terrains d'agrément,,,1245,0.263473,46.143292
2021-1493314,2021-12-21,000001,Vente,150000,5391,F,DALIDANT,B077,86400,86237,Saint-Pierre-d'Exideuil,86,,,862370000E0498,,,,,,,,,,,,,0,1,Maison,117,4,AG,terrains d'agrément,,,1245,0.263473,46.143292
2021-1494004,2021-12-22,000001,Vente,100990,21,,LA BONNARDELIERE,B028,86400,86237,Saint-Pierre-d'Exideuil,86,,,862370000B0929,,,,,,,,,,,,,0,1,Maison,74,3,T,terres,,,601,0.243607,46.174099
2021-1494004,2021-12-22,000001,Vente,100990,21,,LA BONNARDELIERE,B028,86400,86237,Saint-Pierre-d'Exideuil,86,,,862370000B0929,,,,,,,,,,,,,0,1,Maison,74,3,T,terres,,,601,0.243607,46.174099
2021-1494004,2021-12-22,000001,Vente,100990,,,LA BONNARDELIERE,B028,86400,86237,Saint-Pierre-d'Exideuil,86,,,862370000B0948,,,,,,,,,,,,,0,,,,,T,terres,,,1134,0.24417,46.174917
2021-1494004,2021-12-22,000001,Vente,100990,,,LA BONNARDELIERE,B028,86400,86237,Saint-Pierre-d'Exideuil,86,,,862370000B0951,,,,,,,,,,,,,0,,,,,T,terres,,,7757,0.243877,46.174646
2021-1494004,2021-12-22,000001,Vente,100990,,,LA BONNARDELIERE,B028,86400,86237,Saint-Pierre-d'Exideuil,86,,,862370000B0951,,,,,,,,,,,,,0,,,,,T,terres,,,7757,0.243877,46.174646
