id_mutation,date_mutation,numero_disposition,nature_mutation,valeur_fonciere,adresse_numero,adresse_suffixe,adresse_nom_voie,adresse_code_voie,code_postal,code_commune,nom_commune,code_departement,ancien_code_commune,ancien_nom_commune,id_parcelle,ancien_id_parcelle,numero_volume,lot1_numero,lot1_surface_carrez,lot2_numero,lot2_surface_carrez,lot3_numero,lot3_surface_carrez,lot4_numero,lot4_surface_carrez,lot5_numero,lot5_surface_carrez,nombre_lots,code_type_local,type_local,surface_reelle_bati,nombre_pieces_principales,code_nature_culture,nature_culture,code_nature_culture_speciale,nature_culture_speciale,surface_terrain,longitude,latitude
2021-1480911,2021-01-07,000001,Vente,11250,,,BOIS TENDRIN,B029,86420,86286,Verrue,86,,,86286000ZI0168,,,,,,,,,,,,,0,,,,,BT,taillis simples,,,1730,0.180802,46.851647
2021-1480911,2021-01-07,000001,Vente,11250,,,BOIS TENDRIN,B029,86420,86286,Verrue,86,,,86286000ZI0227,,,,,,,,,,,,,0,,,,,BT,taillis simples,,,7700,0.180947,46.851047
2021-1480911,2021-01-07,000001,Vente,11250,5254,,LE BOIS VERT,B031,86420,86286,Verrue,86,,,86286000ZK0016,,,,,,,,,,,,,0,3,Dépendance,,0,BT,taillis simples,,,8900,0.163412,46.846753
2021-1480911,2021-01-07,000001,Vente,11250,5254,,LE BOIS VERT,B031,86420,86286,Verrue,86,,,86286000ZK0016,,,,,,,,,,,,,0,3,Dépendance,,0,S,sols,,,70,0.163412,46.846753
2021-1480911,2021-01-07,000001,Vente,11250,,,LE BOIS VERT,B031,86420,86286,Verrue,86,,,86286000ZK0027,,,,,,,,,,,,,0,,,,,BT,taillis simples,,,4500,0.164881,46.846003
2021-1480911,2021-01-07,000001,Vente,11250,,,LA VOYE BERNARD,B216,86420,86286,Verrue,86,,,86286000ZT0145,,,,,,,,,,,,,0,,,,,T,terres,,,1160,0.137937,46.875458
2021-1480911,2021-01-07,000001,Vente,11250,,,LA VOYE BERNARD,B216,86420,86286,Verrue,86,,,86286000ZT0145,,,,,,,,,,,,,0,,,,,BP,peupleraies,,,1040,0.137937,46.875458
2021-1480911,2021-01-07,000001,Vente,11250,,,LA VOYE BERNARD,B216,86420,86286,Verrue,86,,,86286000ZT0147,,,,,,,,,,,,,0,,,,,T,terres,,,4840,0.137239,46.875483
2021-1481957,2021-02-18,000001,Vente,990,,,LE CHAUMERON,B059,86420,86286,Verrue,86,,,86286000ZH0014,,,,,,,,,,,,,0,,,,,T,terres,,,720,0.197815,46.868979
2021-1481957,2021-02-18,000001,Vente,990,,,LE CHAUMERON,B059,86420,86286,Verrue,86,,,86286000ZH0014,,,,,,,,,,,,,0,,,,,BT,taillis simples,,,2660,0.197815,46.868979
2021-1483141,2021-04-02,000001,Vente,1500,,,LA TOUCHE,B201,86420,86286,Verrue,86,,,86286000ZV0057,,,,,,,,,,,,,0,,,,,T,terres,,,1860,0.148592,46.879336
2021-1483148,2021-03-29,000001,Vente,110000,,,LA GARENNE,B090,86420,86286,Verrue,86,,,86286000ZK0138,,,,,,,,,,,,,0,,,,,J,jardins,,,627,0.166374,46.853306
2021-1483148,2021-03-29,000001,Vente,110000,3,,LA GARENNE,B090,86420,86286,Verrue,86,,,86286000ZK0139,,,,,,,,,,,,,0,1,Maison,102,4,S,sols,,,1108,0.166535,46.85337
2021-1483212,2021-03-31,000001,Vente,64000,,,LES BASSES CHAULERIES,B007,86420,86286,Verrue,86,,,86286000ZS0020,,,,,,,,,,,,,0,,,,,T,terres,,,2040,0.156401,46.886946
2021-1483212,2021-03-31,000001,Vente,64000,2,,RUE DES BASSES CHAULERIES,0010,86420,86286,Verrue,86,,,86286000ZS0237,,,,,,,,,,,,,0,1,Maison,70,2,S,sols,,,1620,0.155868,46.887186
2021-1483232,2021-04-21,000001,Vente,71000,2,,RUE DU MOULIN BIGEARD,0131,86420,86286,Verrue,86,,,86286000ZO0127,,,,,,,,,,,,,0,1,Maison,91,2,S,sols,,,1410,0.175812,46.864968
2021-1485969,2021-06-22,000001,Vente,64500,1,,RUELLE DE LA BIE,A021,86420,86286,Verrue,86,,,86286000AK0340,,,,,,,,,,,,,0,1,Maison,153,6,T,terres,,,425,0.168577,46.861141
2021-1485969,2021-06-22,000001,Vente,64500,1,,RUELLE DE LA BIE,A021,86420,86286,Verrue,86,,,86286000AK0340,,,,,,,,,,,,,0,1,Maison,153,6,S,sols,,,965,0.168577,46.861141
2021-1485969,2021-06-22,000001,Vente,64500,1,,RUELLE DE LA BIE,A021,86420,86286,Verrue,86,,,86286000AK0340,,,,,,,,,,,,,0,3,Dépendance,,0,S,sols,,,965,0.168577,46.861141
2021-1485969,2021-06-22,000001,Vente,64500,1,,RUELLE DE LA BIE,A021,86420,86286,Verrue,86,,,86286000AK0340,,,,,,,,,,,,,0,3,Dépendance,,0,T,terres,,,425,0.168577,46.861141
2021-1486447,2021-07-02,000001,Vente,210000,2,,RUE DE LA BIE,0020,86420,86286,Verrue,86,,,86286000AK0241,,,,,,,,,,,,,0,1,Maison,197,5,S,sols,,,3473,0.170239,46.860661
2021-1486447,2021-07-02,000001,Vente,210000,,,LA BIE,B010,86420,86286,Verrue,86,,,86286000AK0242,,,,,,,,,,,,,0,,,,,T,terres,,,835,0.169306,46.860581
2021-1486987,2021-07-15,000001,Vente,75000,,,LA PAGOTTIERE,B144,86420,86286,Verrue,86,,,86286000ZD0193,,,,,,,,,,,,,0,,,,,S,sols,,,620,0.204571,46.859151
2021-1486987,2021-07-15,000001,Vente,75000,9,,LA PAGOTTIERE,B144,86420,86286,Verrue,86,,,86286000ZD0194,,,,,,,,,,,,,0,1,Maison,62,1,S,sols,,,360,0.204467,46.859361
2021-1486987,2021-07-15,000001,Vente,75000,9,,LA PAGOTTIERE,B144,86420,86286,Verrue,86,,,86286000ZD0194,,,,,,,,,,,,,0,3,Dépendance,,0,S,sols,,,360,0.204467,46.859361
2021-1486987,2021-07-15,000001,Vente,75000,9,,LA PAGOTTIERE,B144,86420,86286,Verrue,86,,,86286000ZD0194,,,,,,,,,,,,,0,3,Dépendance,,0,S,sols,,,360,0.204467,46.859361
2021-1486987,2021-07-15,000001,Vente,75000,,,LA PAGOTTIERE,B144,86420,86286,Verrue,86,,,86286000ZD0201,,,,,,,,,,,,,0,,,,,S,sols,,,139,0.204757,46.859226
2021-1487821,2021-07-23,000001,Vente,98900,,,LA HUTTE,B113,86420,86286,Verrue,86,,,86286000ZS0266,,,,,,,,,,,,,0,,,,,T,terres,,,153,0.156893,46.888738
2021-1487821,2021-07-23,000001,Vente,98900,,,LA HUTTE,B113,86420,86286,Verrue,86,,,86286000ZS0269,,,,,,,,,,,,,0,,,,,T,terres,,,124,0.156947,46.888814
2021-1487821,2021-07-23,000001,Vente,98900,,,LES BASSES CHAULERIES,B007,86420,86286,Verrue,86,,,86286000ZS0271,,,,,,,,,,,,,0,,,,,S,sols,,,3,0.156806,46.888695
2021-1487821,2021-07-23,000001,Vente,98900,,,LES BASSES CHAULERIES,B007,86420,86286,Verrue,86,,,86286000ZS0272,,,,,,,,,,,,,0,,,,,S,sols,,,2,0.1566,46.888749
2021-1487821,2021-07-23,000001,Vente,98900,10,,RUE DES BASSES CHAULERIES,0010,86420,86286,Verrue,86,,,86286000ZS0276,,,,,,,,,,,,,0,1,Maison,89,3,S,sols,,,346,0.15673,46.888797
2021-1487821,2021-07-23,000001,Vente,98900,10,,RUE DES BASSES CHAULERIES,0010,86420,86286,Verrue,86,,,86286000ZS0276,,,,,,,,,,,,,0,1,Maison,89,3,S,sols,,,346,0.15673,46.888797
2021-1488726,2021-08-31,000001,Vente,5622.5,,,LES PRES JOUSE,B172,86420,86286,Verrue,86,,,86286000ZD0172,,,,,,,,,,,,,0,,,,,T,terres,,,12490,0.204662,46.867519
2021-1489458,2021-09-10,000001,Vente,6000,,,LE BOURG,B033,86420,86286,Verrue,86,,,86286000AK0344,,,,,,,,,,,,,0,,,,,S,sols,,,231,0.174294,46.863683
2021-1490163,2021-10-01,000001,Echange,12454,,,BRIZAY,B036,86420,86286,Verrue,86,,,86286000ZD0097,,,,,,,,,,,,,0,,,,,T,terres,,,19160,0.215753,46.858678
2021-1490519,2021-09-28,000002,Vente,300,2,,LA BALBINIERE,B004,86420,86286,Verrue,86,,,86286000ZV0168,,,,,,,,,,,,,0,4,Local industriel. commercial ou assimilé,352,0,S,sols,,,30,0.141359,46.882484
2021-1490519,2021-09-28,000002,Vente,300,2,,LA BALBINIERE,B004,86420,86286,Verrue,86,,,86286000ZV0168,,,,,,,,,,,,,0,1,Maison,169,4,S,sols,,,30,0.141359,46.882484
2021-1490519,2021-09-28,000002,Vente,300,2,,LA BALBINIERE,B004,86420,86286,Verrue,86,,,86286000ZV0168,,,,,,,,,,,,,0,4,Local industriel. commercial ou assimilé,351,0,S,sols,,,30,0.141359,46.882484
2021-1491090,2021-10-15,000001,Vente,83000,,,LA HUTTE,B113,86420,86286,Verrue,86,,,86286000ZS0270,,,,,,,,,,,,,0,,,,,T,terres,,,109,0.157013,46.888893
2021-1491090,2021-10-15,000001,Vente,83000,8,,RUE DES BASSES CHAULERIES,0010,86420,86286,Verrue,86,,,86286000ZS0279,,,,,,,,,,,,,0,,,,,S,sols,,,499,0.15668,46.888888
2021-1493007,2021-12-03,000001,Echange,2000,,,LE VERGENOTON,B209,86420,86286,Verrue,86,,,86286000ZH0238,,,,,,,,,,,,,0,,,,,T,terres,,,4773,0.190483,46.868124
2021-1493007,2021-12-03,000002,Echange,2000,,,LE VERGENOTON,B209,86420,86286,Verrue,86,,,86286000ZH0152,,,,,,,,,,,,,0,,,,,T,terres,,,4140,0.189083,46.867555
2021-1493337,2021-12-15,000001,Vente,80000,,,PRE MAILLY,B165,86420,86286,Verrue,86,,,86286000ZK0116,,,,,,,,,,,,,0,,,,,T,terres,,,3780,0.160104,46.842927
2021-1493337,2021-12-15,000001,Vente,80000,,,LES CHAMPS DE VANDELLE,B049,86420,86286,Verrue,86,,,86286000ZL0106,,,,,,,,,,,,,0,,,,,T,terres,,,18540,0.14985,46.839164
2021-1493337,2021-12-15,000001,Vente,80000,,,LA CARTE,B040,86420,86286,Verrue,86,,,86286000ZL0123,,,,,,,,,,,,,0,,,,,T,terres,,,9140,0.1476,46.84508
2021-1493337,2021-12-15,000001,Vente,80000,,,LE SILLON,B185,86420,86286,Verrue,86,,,86286000ZM0024,,,,,,,,,,,,,0,,,,,T,terres,,,4600,0.143174,46.849888
2021-1493337,2021-12-15,000001,Vente,80000,,,LE SILLON,B185,86420,86286,Verrue,86,,,86286000ZM0025,,,,,,,,,,,,,0,,,,,T,terres,,,11690,0.142874,46.849448
2021-1493752,2021-12-29,000001,Vente,140,,,BOIS BOUILLES,B012,86420,86286,Verrue,86,,,862860000L0335,,,,,,,,,,,,,0,,,,,BT,taillis simples,,,1402,0.221484,46.869733
2021-1493770,2021-12-29,000001,Vente,20300,,,LA GAUSSEE,B093,86420,86286,Verrue,86,,,86286000ZD0029,,,,,,,,,,,,,0,,,,,T,terres,,,1950,0.212865,46.8627
2021-1494035,2021-12-30,000001,Vente,63000,13,,RUE GRAND RUE,0070,86420,86286,Verrue,86,,,86286000AK0177,,,,,,,,,,,,,0,3,Dépendance,,0,S,sols,,,577,0.169465,46.862127
2021-1494035,2021-12-30,000001,Vente,63000,13,,RUE GRAND RUE,0070,86420,86286,Verrue,86,,,86286000AK0177,,,,,,,,,,,,,0,3,Dépendance,,0,S,sols,,,577,0.169465,46.862127
2021-1494035,2021-12-30,000001,Vente,63000,13,,RUE GRAND RUE,0070,86420,86286,Verrue,86,,,86286000AK0177,,,,,,,,,,,,,0,1,Maison,13,1,S,sols,,,577,0.169465,46.862127
2021-1494035,2021-12-30,000001,Vente,63000,13,,RUE GRAND RUE,0070,86420,86286,Verrue,86,,,86286000AK0177,,,,,,,,,,,,,0,1,Maison,113,3,S,sols,,,577,0.169465,46.862127
2021-1494035,2021-12-30,000001,Vente,63000,,,LE BOURG,B033,86420,86286,Verrue,86,,,86286000AK0183,,,,,,,,,,,,,0,,,,,J,jardins,,,657,0.169026,46.861984
2021-1494050,2021-12-06,000001,Expropriation,26.32,,,SUR LES PERRIERES,B149,86420,86286,Verrue,86,,,86286000ZN0402,,,,,,,,,,,,,0,,,,,S,sols,,,43,0.156877,46.86381
