id_mutation,date_mutation,numero_disposition,nature_mutation,valeur_fonciere,adresse_numero,adresse_suffixe,adresse_nom_voie,adresse_code_voie,code_postal,code_commune,nom_commune,code_departement,ancien_code_commune,ancien_nom_commune,id_parcelle,ancien_id_parcelle,numero_volume,lot1_numero,lot1_surface_carrez,lot2_numero,lot2_surface_carrez,lot3_numero,lot3_surface_carrez,lot4_numero,lot4_surface_carrez,lot5_numero,lot5_surface_carrez,nombre_lots,code_type_local,type_local,surface_reelle_bati,nombre_pieces_principales,code_nature_culture,nature_culture,code_nature_culture_speciale,nature_culture_speciale,surface_terrain,longitude,latitude
2021-1506207,2021-02-19,000001,Vente,20000,,,ENTRE LES JARDINS,B026,88500,88056,Bettoncourt,88,,,880560000A0374,,,,,,,,,,,,,0,,,,,S,sols,,,25,6.159093,48.348142
2021-1506207,2021-02-19,000001,Vente,20000,366,,RUE DU CAP. SIMON DE CHATELLUS,0003,88500,88056,Bettoncourt,88,,,880560000A0656,,,,,,,,,,,,,0,1,Maison,97,2,S,sols,,,437,6.159001,48.348308
2021-1506207,2021-02-19,000001,Vente,20000,,,ENTRE LES JARDINS,B026,88500,88056,Bettoncourt,88,,,880560000A0797,,,,,,,,,,,,,0,,,,,VE,vergers,,,974,6.158741,48.348278
2021-1506207,2021-02-19,000001,Vente,20000,,,ENTRE LES JARDINS,B026,88500,88056,Bettoncourt,88,,,880560000A0799,,,,,,,,,,,,,0,,,,,P,prés,,,1997,6.158083,48.348219
2021-1506207,2021-02-19,000001,Vente,20000,,,ENTRE LES JARDINS,B026,88500,88056,Bettoncourt,88,,,880560000A0801,,,,,,,,,,,,,0,,,,,VE,vergers,,,770,6.158541,48.34845
2021-1506360,2021-03-05,000001,Vente,1150,,,CRESSONCOURT,B020,88500,88056,Bettoncourt,88,,,880560000A0127,,,,,,,,,,,,,0,,,,,VE,vergers,,,1860,6.171095,48.344985
2021-1506592,2021-03-13,000001,Vente,4832,,,DERRIERE LE COLOMBIER,B022,88500,88056,Bettoncourt,88,,,880560000A0901,,,,,,,,,,,,,0,,,,,T,terres,,,604,6.163865,48.34832
2021-1511541,2021-10-18,000001,Vente,18000,152,,RUE MADON,B054,88500,88056,Bettoncourt,88,,,880560000A0432,,,,,,,,,,,,,0,1,Maison,50,2,S,sols,,,662,6.160478,48.350105
