id_mutation,date_mutation,numero_disposition,nature_mutation,valeur_fonciere,adresse_numero,adresse_suffixe,adresse_nom_voie,adresse_code_voie,code_postal,code_commune,nom_commune,code_departement,ancien_code_commune,ancien_nom_commune,id_parcelle,ancien_id_parcelle,numero_volume,lot1_numero,lot1_surface_carrez,lot2_numero,lot2_surface_carrez,lot3_numero,lot3_surface_carrez,lot4_numero,lot4_surface_carrez,lot5_numero,lot5_surface_carrez,nombre_lots,code_type_local,type_local,surface_reelle_bati,nombre_pieces_principales,code_nature_culture,nature_culture,code_nature_culture_speciale,nature_culture_speciale,surface_terrain,longitude,latitude
2021-1512935,2021-12-23,000001,Vente,173000,,,DERRIERE LA HAYE,B019,88430,88059,Biffontaine,88,,,880590000A0159,,,,,,,,,,,,,0,,,,,T,terres,,,1500,6.796114,48.205745
2021-1512935,2021-12-23,000001,Vente,173000,,,DERRIERE LA HAYE,B019,88430,88059,Biffontaine,88,,,880590000A1054,,,,,,,,,,,,,0,,,,,T,terres,,,1480,6.796222,48.205817
2021-1513707,2021-01-21,000001,Vente,2460,,,MOULIN COME,B058,88430,88059,Biffontaine,88,,,880590000A0596,,,,,,,,,,,,,0,,,,,BR,futaies résineuses,,,4980,6.831272,48.221625
2021-1513708,2021-01-22,000001,Vente,700,,,MOULIN COME,B058,88430,88059,Biffontaine,88,,,880590000A0596,,,,,,,,,,,,,0,,,,,BR,futaies résineuses,,,4980,6.831272,48.221625
2021-1514024,2021-02-12,000001,Vente,1789,,,LA BOUDIERE,B006,88430,88059,Biffontaine,88,,,880590000B0038,,,,,,,,,,,,,0,,,,,P,prés,,,2950,6.807497,48.208586
2021-1514024,2021-02-12,000001,Vente,1789,,,LE SERVISTA,B080,88430,88059,Biffontaine,88,,,880590000B0361,,,,,,,,,,,,,0,,,,,T,terres,,,1340,6.81443,48.20997
2021-1514024,2021-02-12,000001,Vente,1789,,,LE SERVISTA,B080,88430,88059,Biffontaine,88,,,880590000B0378,,,,,,,,,,,,,0,,,,,T,terres,,,1510,6.816286,48.20972
2021-1514024,2021-02-12,000001,Vente,1789,,,LES PRES PINAUX,B071,88430,88059,Biffontaine,88,,,880590000B0683,,,,,,,,,,,,,0,,,,,P,prés,,,1800,6.813716,48.206961
2021-1514024,2021-02-12,000001,Vente,1789,,,LE SERVISTA,B080,88430,88059,Biffontaine,88,,,880590000B0795,,,,,,,,,,,,,0,,,,,T,terres,,,1345,6.81735,48.210124
2021-1514158,2021-03-05,000001,Vente,110000,823,,CHE DE LA BASSE DE BELMONT,0003,88430,88059,Biffontaine,88,,,880590000A1402,,,,,,,,,,,,,0,1,Maison,130,4,S,sols,,,289,6.797064,48.216703
2021-1514158,2021-03-05,000001,Vente,110000,,,LA CENSE DES ARBOIS,B008,88430,88059,Biffontaine,88,,,880590000A1403,,,,,,,,,,,,,0,,,,,P,prés,,,3217,6.797523,48.216721
2021-1514158,2021-03-05,000001,Vente,110000,,,LA CENSE DES ARBOIS,B008,88430,88059,Biffontaine,88,,,880590000A1406,,,,,,,,,,,,,0,,,,,T,terres,,,2512,6.7972,48.216541
2021-1514290,2021-03-29,000001,Vente,19000,,,DEVANT CHEZ TIMON,B022,88430,88059,Biffontaine,88,,,880590000A1366,,,,,,,,,,,,,0,,,,,T,terres,,,164,6.8045,48.213435
2021-1514290,2021-03-29,000001,Vente,19000,,,DEVANT CHEZ TIMON,B022,88430,88059,Biffontaine,88,,,880590000A1368,,,,,,,,,,,,,0,,,,,T,terres,,,137,6.804612,48.213461
2021-1514290,2021-03-29,000001,Vente,19000,,,DEVANT CHEZ TIMON,B022,88430,88059,Biffontaine,88,,,880590000A1370,,,,,,,,,,,,,0,,,,,S,sols,,,102,6.804623,48.213307
2021-1514290,2021-03-29,000001,Vente,19000,,,DEVANT CHEZ TIMON,B022,88430,88059,Biffontaine,88,,,880590000A1372,,,,,,,,,,,,,0,,,,,T,terres,,,103,6.804699,48.213345
2021-1514290,2021-03-29,000001,Vente,19000,,,DEVANT CHEZ TIMON,B022,88430,88059,Biffontaine,88,,,880590000A1522,,,,,,,,,,,,,0,,,,,T,terres,,,684,6.804833,48.213487
2021-1514486,2021-04-09,000001,Vente,98000,196,,RTE DE LA HOUSSIERE,0039,88430,88059,Biffontaine,88,,,880590000B0966,,,,,,,,,,,,,0,,,,,S,sols,,,97,6.809274,48.210079
2021-1514486,2021-04-09,000001,Vente,98000,6,,LE VILLAGE,B090,88430,88059,Biffontaine,88,,,880590000B0968,,,,,,,,,,,,,0,,,,,S,sols,,,92,6.809521,48.210186
2021-1514486,2021-04-09,000001,Vente,98000,6,,LE HAUT DU PARC,B092,88430,88059,Biffontaine,88,,,880590000B0969,,,,,,,,,,,,,0,1,Maison,79,4,S,sols,,,890,6.809971,48.210239
2021-1514486,2021-04-09,000001,Vente,98000,,,LE VILLAGE,B090,88430,88059,Biffontaine,88,,,880590000B0970,,,,,,,,,,,,,0,,,,,P,prés,,,1428,6.809319,48.209912
2021-1514486,2021-04-09,000001,Vente,98000,,,LE VILLAGE,B090,88430,88059,Biffontaine,88,,,880590000B0971,,,,,,,,,,,,,0,,,,,P,prés,,,704,6.809818,48.210062
2021-1514881,2021-05-21,000001,Vente,706,,,LES BANCS,B002,88430,88059,Biffontaine,88,,,880590000B0687,,,,,,,,,,,,,0,,,,,P,prés,,,3530,6.817286,48.206562
2021-1515001,2021-06-25,000001,Vente,240000,375,,CHE DE LA BASSE DE BELMONT,0003,88430,88059,Biffontaine,88,,,880590000A0205,,,,,,,,,,,,,0,1,Maison,97,3,S,sols,,,806,6.800421,48.214024
2021-1515001,2021-06-25,000001,Vente,240000,,,MENHU,B053,88430,88059,Biffontaine,88,,,880590000A1161,,,,,,,,,,,,,0,,,,,T,terres,,,70,6.800339,48.214117
2021-1515001,2021-06-25,000001,Vente,240000,,,MENHU,B053,88430,88059,Biffontaine,88,,,880590000A1165,,,,,,,,,,,,,0,,,,,T,terres,,,238,6.800178,48.214041
2021-1515001,2021-06-25,000001,Vente,240000,,,LA FOSSE,B036,88430,88059,Biffontaine,88,,,880590000A1167,,,,,,,,,,,,,0,,,,,P,prés,,,2860,6.800624,48.213685
2021-1515001,2021-06-25,000001,Vente,240000,,,MENHU,B053,88430,88059,Biffontaine,88,,,880590000A1526,,,,,,,,,,,,,0,,,,,P,prés,,,399,6.800857,48.214202
2021-1515001,2021-06-25,000001,Vente,240000,,,MENHU,B053,88430,88059,Biffontaine,88,,,880590000A1528,,,,,,,,,,,,,0,,,,,T,terres,,,341,6.80045,48.21418
2021-1515001,2021-06-25,000001,Vente,240000,,,MENHU,B053,88430,88059,Biffontaine,88,,,880590000A1559,,,,,,,,,,,,,0,,,,,S,sols,,,22,6.80049,48.213965
2021-1515089,2021-07-01,000001,Vente,98600,448,,RTE DE LES POULIERES,0046,88430,88059,Biffontaine,88,,,880590000A1059,,,,,,,,,,,,,0,3,Dépendance,,0,S,sols,,,398,6.801457,48.207107
2021-1515089,2021-07-01,000001,Vente,98600,448,,RTE DE LES POULIERES,0046,88430,88059,Biffontaine,88,,,880590000A1059,,,,,,,,,,,,,0,3,Dépendance,,0,T,terres,,,2832,6.801457,48.207107
2021-1515089,2021-07-01,000001,Vente,98600,448,,RTE DE LES POULIERES,0046,88430,88059,Biffontaine,88,,,880590000A1059,,,,,,,,,,,,,0,1,Maison,74,3,S,sols,,,398,6.801457,48.207107
2021-1515089,2021-07-01,000001,Vente,98600,448,,RTE DE LES POULIERES,0046,88430,88059,Biffontaine,88,,,880590000A1059,,,,,,,,,,,,,0,1,Maison,74,3,T,terres,,,2832,6.801457,48.207107
2021-1515358,2021-08-02,000001,Vente,613.5,,,LA QUETEUSE,B072,88430,88059,Biffontaine,88,,,880590000B0117,,,,,,,,,,,,,0,,,,,B,bois,,,1960,6.80507,48.202486
2021-1515358,2021-08-02,000001,Vente,613.5,,,LA QUETEUSE,B072,88430,88059,Biffontaine,88,,,880590000B0127,,,,,,,,,,,,,0,,,,,P,prés,,,2130,6.808456,48.20351
2021-1515359,2021-08-02,000001,Vente,679.5,,,LA QUETEUSE,B072,88430,88059,Biffontaine,88,,,880590000B0118,,,,,,,,,,,,,0,,,,,BR,futaies résineuses,,,4530,6.805509,48.201915
2021-1515444,2021-08-06,000001,Vente,175000,,,AUX FEINGS DES COANCHES,B034,88430,88059,Biffontaine,88,,,880590000A1504,,,,,,,,,,,,,0,,,,,P,prés,,,792,6.837775,48.208531
2021-1515444,2021-08-06,000001,Vente,175000,115,,CHE DU FEING DES COANCHES,0020,88430,88059,Biffontaine,88,,,880590000A1506,,,,,,,,,,,,,0,1,Maison,164,5,S,sols,,,1503,6.837497,48.208612
2021-1515511,2021-08-02,000001,Vente,20000,,,LE VILLAGE,B090,88430,88059,Biffontaine,88,,,880590000B0246,,,,,,,,,,,,,0,,,,,P,prés,,,216,6.809004,48.209808
2021-1515511,2021-08-02,000001,Vente,20000,,,LE VILLAGE,B090,88430,88059,Biffontaine,88,,,880590000B0907,,,,,,,,,,,,,0,,,,,P,prés,,,1505,,
2021-1515511,2021-08-02,000001,Vente,20000,,,LE VILLAGE,B090,88430,88059,Biffontaine,88,,,880590000B0909,,,,,,,,,,,,,0,,,,,T,terres,,,953,,
2021-1515511,2021-08-02,000001,Vente,20000,,,LE VILLAGE,B090,88430,88059,Biffontaine,88,,,880590000B0909,,,,,,,,,,,,,0,,,,,S,sols,,,95,,
